fatal: not a git repository (or any of the parent directories): .git
mkdir -p ".tmp" ".tmp/Source" ".tmp/Source/nnue"
NNUE network 'net56.nnue' not found.
Downloading with curl...
  % Total    % Received % Xferd  Average Speed   Time    Time     Time  Current
                                 Dload  Upload   Total   Spent    Left  Speed

  0     0    0     0    0     0      0      0 --:--:-- --:--:-- --:--:--     0
  0     0    0     0    0     0      0      0 --:--:-- --:--:-- --:--:--     0
  0     0    0     0    0     0      0      0 --:--:-- --:--:-- --:--:--     0

  0  212M    0  8259    0     0   5808      0 10:39:45  0:00:01 10:39:44  5808
  0  212M    0 1708k    0     0   733k      0  0:04:56  0:00:02  0:04:54 1872k
  8  212M    8 18.9M    0     0  5833k      0  0:00:37  0:00:03  0:00:34  9.9M
 19  212M   19 41.0M    0     0  9717k      0  0:00:22  0:00:04  0:00:18 14.1M
 29  212M   29 62.6M    0     0  11.7M      0  0:00:18  0:00:05  0:00:13 16.0M
 39  212M   39 84.2M    0     0  13.3M      0  0:00:15  0:00:06  0:00:09 17.1M
 50  212M   50  106M    0     0  14.5M      0  0:00:14  0:00:07  0:00:07 21.0M
 60  212M   60  127M    0     0  15.3M      0  0:00:13  0:00:08  0:00:05 21.7M
 70  212M   70  149M    0     0  16.0M      0  0:00:13  0:00:09  0:00:04 21.6M
 80  212M   80  170M    0     0  16.5M      0  0:00:12  0:00:10  0:00:02 21.6M
 91  212M   91  194M    0     0  17.1M      0  0:00:12  0:00:11  0:00:01 22.1M
100  212M  100  212M    0     0  17.3M      0  0:00:12  0:00:12 --:--:-- 21.3M
Downloaded net56.nnue
fatal: not a git repository (or any of the parent directories): .git
gcc -g -std=gnu11 -funroll-loops -O3 -flto -fno-exceptions -DIS_64BIT -DNDEBUG -DGIT_HASH=\"\" -Wall -Werror -Wextra -Wno-error=vla -Wpedantic -Wno-unused-command-line-argument -DUSE_SIMD -DNETWORK_NAME=\"net56.nnue\" -DEVALFILE=\"processed.bin\" -o Tools/process_net Tools/process_net.c -pthread -lm
./Tools/process_net net56.nnue processed.bin
gcc -g -std=gnu11 -funroll-loops -O3 -flto -fno-exceptions -DIS_64BIT -DNDEBUG -Wall -Werror -Wextra -Wno-error=vla -Wpedantic -Wno-unused-command-line-argument -DGIT_HASH=\"\" -DUSE_AVX2 -DUSE_SIMD -mavx2 -mbmi -mbmi2 -DNETWORK_NAME=\"net56.nnue\" -DEVALFILE=\"processed.bin\" -march=native -MMD -MP -c Source/uci.c -o .tmp/Source/uci.o -pthread -lm
gcc -g -std=gnu11 -funroll-loops -O3 -flto -fno-exceptions -DIS_64BIT -DNDEBUG -Wall -Werror -Wextra -Wno-error=vla -Wpedantic -Wno-unused-command-line-argument -DGIT_HASH=\"\" -DUSE_AVX2 -DUSE_SIMD -mavx2 -mbmi -mbmi2 -DNETWORK_NAME=\"net56.nnue\" -DEVALFILE=\"processed.bin\" -march=native -MMD -MP -c Source/evaluate.c -o .tmp/Source/evaluate.o -pthread -lm
gcc -g -std=gnu11 -funroll-loops -O3 -flto -fno-exceptions -DIS_64BIT -DNDEBUG -Wall -Werror -Wextra -Wno-error=vla -Wpedantic -Wno-unused-command-line-argument -DGIT_HASH=\"\" -DUSE_AVX2 -DUSE_SIMD -mavx2 -mbmi -mbmi2 -DNETWORK_NAME=\"net56.nnue\" -DEVALFILE=\"processed.bin\" -march=native -MMD -MP -c Source/datagen.c -o .tmp/Source/datagen.o -pthread -lm
gcc -g -std=gnu11 -funroll-loops -O3 -flto -fno-exceptions -DIS_64BIT -DNDEBUG -Wall -Werror -Wextra -Wno-error=vla -Wpedantic -Wno-unused-command-line-argument -DGIT_HASH=\"\" -DUSE_AVX2 -DUSE_SIMD -mavx2 -mbmi -mbmi2 -DNETWORK_NAME=\"net56.nnue\" -DEVALFILE=\"processed.bin\" -march=native -MMD -MP -c Source/syzygy.c -o .tmp/Source/syzygy.o -pthread -lm
gcc -g -std=gnu11 -funroll-loops -O3 -flto -fno-exceptions -DIS_64BIT -DNDEBUG -Wall -Werror -Wextra -Wno-error=vla -Wpedantic -Wno-unused-command-line-argument -DGIT_HASH=\"\" -DUSE_AVX2 -DUSE_SIMD -mavx2 -mbmi -mbmi2 -DNETWORK_NAME=\"net56.nnue\" -DEVALFILE=\"processed.bin\" -march=native -MMD -MP -c Source/attacks.c -o .tmp/Source/attacks.o -pthread -lm
gcc -g -std=gnu11 -funroll-loops -O3 -flto -fno-exceptions -DIS_64BIT -DNDEBUG -Wall -Werror -Wextra -Wno-error=vla -Wpedantic -Wno-unused-command-line-argument -DGIT_HASH=\"\" -DUSE_AVX2 -DUSE_SIMD -mavx2 -mbmi -mbmi2 -DNETWORK_NAME=\"net56.nnue\" -DEVALFILE=\"processed.bin\" -march=native -MMD -MP -c Source/see.c -o .tmp/Source/see.o -pthread -lm
gcc -g -std=gnu11 -funroll-loops -O3 -flto -fno-exceptions -DIS_64BIT -DNDEBUG -Wall -Werror -Wextra -Wno-error=vla -Wpedantic -Wno-unused-command-line-argument -DGIT_HASH=\"\" -DUSE_AVX2 -DUSE_SIMD -mavx2 -mbmi -mbmi2 -DNETWORK_NAME=\"net56.nnue\" -DEVALFILE=\"processed.bin\" -march=native -MMD -MP -c Source/movegen.c -o .tmp/Source/movegen.o -pthread -lm
gcc -g -std=gnu11 -funroll-loops -O3 -flto -fno-exceptions -DIS_64BIT -DNDEBUG -Wall -Werror -Wextra -Wno-error=vla -Wpedantic -Wno-unused-command-line-argument -DGIT_HASH=\"\" -DUSE_AVX2 -DUSE_SIMD -mavx2 -mbmi -mbmi2 -DNETWORK_NAME=\"net56.nnue\" -DEVALFILE=\"processed.bin\" -march=native -MMD -MP -c Source/quanticade.c -o .tmp/Source/quanticade.o -pthread -lm
gcc -g -std=gnu11 -funroll-loops -O3 -flto -fno-exceptions -DIS_64BIT -DNDEBUG -Wall -Werror -Wextra -Wno-error=vla -Wpedantic -Wno-unused-command-line-argument -DGIT_HASH=\"\" -DUSE_AVX2 -DUSE_SIMD -mavx2 -mbmi -mbmi2 -DNETWORK_NAME=\"net56.nnue\" -DEVALFILE=\"processed.bin\" -march=native -MMD -MP -c Source/move.c -o .tmp/Source/move.o -pthread -lm
gcc -g -std=gnu11 -funroll-loops -O3 -flto -fno-exceptions -DIS_64BIT -DNDEBUG -Wall -Werror -Wextra -Wno-error=vla -Wpedantic -Wno-unused-command-line-argument -DGIT_HASH=\"\" -DUSE_AVX2 -DUSE_SIMD -mavx2 -mbmi -mbmi2 -DNETWORK_NAME=\"net56.nnue\" -DEVALFILE=\"processed.bin\" -march=native -MMD -MP -c Source/perft.c -o .tmp/Source/perft.o -pthread -lm
gcc -g -std=gnu11 -funroll-loops -O3 -flto -fno-exceptions -DIS_64BIT -DNDEBUG -Wall -Werror -Wextra -Wno-error=vla -Wpedantic -Wno-unused-command-line-argument -DGIT_HASH=\"\" -DUSE_AVX2 -DUSE_SIMD -mavx2 -mbmi -mbmi2 -DNETWORK_NAME=\"net56.nnue\" -DEVALFILE=\"processed.bin\" -march=native -MMD -MP -c Source/wdl.c -o .tmp/Source/wdl.o -pthread -lm
gcc -g -std=gnu11 -funroll-loops -O3 -flto -fno-exceptions -DIS_64BIT -DNDEBUG -Wall -Werror -Wextra -Wno-error=vla -Wpedantic -Wno-unused-command-line-argument -DGIT_HASH=\"\" -DUSE_AVX2 -DUSE_SIMD -mavx2 -mbmi -mbmi2 -DNETWORK_NAME=\"net56.nnue\" -DEVALFILE=\"processed.bin\" -march=native -MMD -MP -c Source/transposition.c -o .tmp/Source/transposition.o -pthread -lm
gcc -g -std=gnu11 -funroll-loops -O3 -flto -fno-exceptions -DIS_64BIT -DNDEBUG -Wall -Werror -Wextra -Wno-error=vla -Wpedantic -Wno-unused-command-line-argument -DGIT_HASH=\"\" -DUSE_AVX2 -DUSE_SIMD -mavx2 -mbmi -mbmi2 -DNETWORK_NAME=\"net56.nnue\" -DEVALFILE=\"processed.bin\" -march=native -MMD -MP -c Source/threads.c -o .tmp/Source/threads.o -pthread -lm
gcc -g -std=gnu11 -funroll-loops -O3 -flto -fno-exceptions -DIS_64BIT -DNDEBUG -Wall -Werror -Wextra -Wno-error=vla -Wpedantic -Wno-unused-command-line-argument -DGIT_HASH=\"\" -DUSE_AVX2 -DUSE_SIMD -mavx2 -mbmi -mbmi2 -DNETWORK_NAME=\"net56.nnue\" -DEVALFILE=\"processed.bin\" -march=native -MMD -MP -c Source/spsa.c -o .tmp/Source/spsa.o -pthread -lm
gcc -g -std=gnu11 -funroll-loops -O3 -flto -fno-exceptions -DIS_64BIT -DNDEBUG -Wall -Werror -Wextra -Wno-error=vla -Wpedantic -Wno-unused-command-line-argument -DGIT_HASH=\"\" -DUSE_AVX2 -DUSE_SIMD -mavx2 -mbmi -mbmi2 -DNETWORK_NAME=\"net56.nnue\" -DEVALFILE=\"processed.bin\" -march=native -MMD -MP -c Source/stats.c -o .tmp/Source/stats.o -pthread -lm
gcc -g -std=gnu11 -funroll-loops -O3 -flto -fno-exceptions -DIS_64BIT -DNDEBUG -Wall -Werror -Wextra -Wno-error=vla -Wpedantic -Wno-unused-command-line-argument -DGIT_HASH=\"\" -DUSE_AVX2 -DUSE_SIMD -mavx2 -mbmi -mbmi2 -DNETWORK_NAME=\"net56.nnue\" -DEVALFILE=\"processed.bin\" -march=native -MMD -MP -c Source/search.c -o .tmp/Source/search.o -pthread -lm
Source/attacks.c: In function ‘knight_threats_setwise’:
gcc -g -std=gnu11 -funroll-loops -O3 -flto -fno-exceptions -DIS_64BIT -DNDEBUG -Wall -Werror -Wextra -Wno-error=vla -Wpedantic -Wno-unused-command-line-argument -DGIT_HASH=\"\" -DUSE_AVX2 -DUSE_SIMD -mavx2 -mbmi -mbmi2 -DNETWORK_NAME=\"net56.nnue\" -DEVALFILE=\"processed.bin\" -march=native -MMD -MP -c Source/nnue.c -o .tmp/Source/nnue.o -pthread -lm
Source/attacks.c:588:8: error: implicit declaration of function ‘__builtin_shufflevector’; did you mean ‘__builtin_eh_filter’? [-Werror=implicit-function-declaration]
  588 |   g |= __builtin_shufflevector(g, g, 2, 3, 0, 1);
      |        ^~~~~~~~~~~~~~~~~~~~~~~
      |        __builtin_eh_filter
gcc -g -std=gnu11 -funroll-loops -O3 -flto -fno-exceptions -DIS_64BIT -DNDEBUG -Wall -Werror -Wextra -Wno-error=vla -Wpedantic -Wno-unused-command-line-argument -DGIT_HASH=\"\" -DUSE_AVX2 -DUSE_SIMD -mavx2 -mbmi -mbmi2 -DNETWORK_NAME=\"net56.nnue\" -DEVALFILE=\"processed.bin\" -march=native -MMD -MP -c Source/history.c -o .tmp/Source/history.o -pthread -lm
gcc -g -std=gnu11 -funroll-loops -O3 -flto -fno-exceptions -DIS_64BIT -DNDEBUG -Wall -Werror -Wextra -Wno-error=vla -Wpedantic -Wno-unused-command-line-argument -DGIT_HASH=\"\" -DUSE_AVX2 -DUSE_SIMD -mavx2 -mbmi -mbmi2 -DNETWORK_NAME=\"net56.nnue\" -DEVALFILE=\"processed.bin\" -march=native -MMD -MP -c Source/utils.c -o .tmp/Source/utils.o -pthread -lm
Source/attacks.c: At top level:
cc1: error: unrecognized command line option ‘-Wno-unused-command-line-argument’ [-Werror]
cc1: all warnings being treated as errors
make: *** [Makefile:281: .tmp/Source/attacks.o] Erro 1
make: ** Esperando que outros processos terminem.