Building Integral-DEFF6EAD-F586B7C9 with BUILD_NATIVE using clang++...
-- The C compiler identification is Clang 16.0.6
-- The CXX compiler identification is Clang 16.0.6
-- Detecting C compiler ABI info
-- Detecting C compiler ABI info - done
-- Check for working C compiler: /usr/bin/clang - skipped
-- Detecting C compile features
-- Detecting C compile features - done
-- Detecting CXX compiler ABI info
-- Detecting CXX compiler ABI info - failed
-- Check for working CXX compiler: /usr/bin/clang++
-- Check for working CXX compiler: /usr/bin/clang++ - broken
CMake Error at /usr/share/cmake-3.28/Modules/CMakeTestCXXCompiler.cmake:60 (message):
The C++ compiler
"/usr/bin/clang++"
is not able to compile a simple test program.
It fails with the following output:
Change Dir: '/tmp/user/1011/tmpi9qf3lop/Integral/Integral-tmp/build/CMakeFiles/CMakeScratch/TryCompile-vUNfPb'
Run Build Command(s): /usr/bin/cmake -E env VERBOSE=1 /usr/bin/gmake -f Makefile cmTC_d45c1/fast
gmake[1]: Entering directory '/tmp/user/1011/tmpi9qf3lop/Integral/Integral-tmp/build/CMakeFiles/CMakeScratch/TryCompile-vUNfPb'
/usr/bin/gmake -f CMakeFiles/cmTC_d45c1.dir/build.make CMakeFiles/cmTC_d45c1.dir/build
gmake[2]: Entering directory '/tmp/user/1011/tmpi9qf3lop/Integral/Integral-tmp/build/CMakeFiles/CMakeScratch/TryCompile-vUNfPb'
Building CXX object CMakeFiles/cmTC_d45c1.dir/testCXXCompiler.cxx.o
/usr/bin/clang++ -MD -MT CMakeFiles/cmTC_d45c1.dir/testCXXCompiler.cxx.o -MF CMakeFiles/cmTC_d45c1.dir/testCXXCompiler.cxx.o.d -o CMakeFiles/cmTC_d45c1.dir/testCXXCompiler.cxx.o -c /tmp/user/1011/tmpi9qf3lop/Integral/Integral-tmp/build/CMakeFiles/CMakeScratch/TryCompile-vUNfPb/testCXXCompiler.cxx
Linking CXX executable cmTC_d45c1
/usr/bin/cmake -E cmake_link_script CMakeFiles/cmTC_d45c1.dir/link.txt --verbose=1
/usr/bin/clang++ CMakeFiles/cmTC_d45c1.dir/testCXXCompiler.cxx.o -o cmTC_d45c1
/usr/bin/ld: cannot find -lstdc++: No such file or directory
clang: error: linker command failed with exit code 1 (use -v to see invocation)
gmake[2]: *** [CMakeFiles/cmTC_d45c1.dir/build.make:100: cmTC_d45c1] Error 1
gmake[2]: Leaving directory '/tmp/user/1011/tmpi9qf3lop/Integral/Integral-tmp/build/CMakeFiles/CMakeScratch/TryCompile-vUNfPb'
gmake[1]: *** [Makefile:127: cmTC_d45c1/fast] Error 2
gmake[1]: Leaving directory '/tmp/user/1011/tmpi9qf3lop/Integral/Integral-tmp/build/CMakeFiles/CMakeScratch/TryCompile-vUNfPb'
CMake will not be able to correctly generate this project.
Call Stack (most recent call first):
CMakeLists.txt:2 (project)
-- Configuring incomplete, errors occurred!
make: *** [Makefile:50: all] Error 1