Building Integral-DEFF6EAD-F586B7C9 with BUILD_NATIVE using clang++...
-- The C compiler identification is Clang 14.0.6
-- The CXX compiler identification is Clang 14.0.6
-- Detecting C compiler ABI info
-- Detecting C compiler ABI info - done
-- Check for working C compiler: /usr/bin/clang - skipped
-- Detecting C compile features
-- Detecting C compile features - done
-- Detecting CXX compiler ABI info
-- Detecting CXX compiler ABI info - done
-- Check for working CXX compiler: /usr/bin/clang++ - skipped
-- Detecting CXX compile features
-- Detecting CXX compile features - done
-- Using user-specified EVALFILE: /home/aron/OpenBench/Client/Networks/F586B7C9
-- Checking for BMI2 support in native build...
-- BMI2 (PEXT) support detected and enabled for Zen 3/4 processor
-- Configuring done
-- Generating done
-- Build files have been written to: /tmp/tmphu8iync1/Integral/Integral-tmp/build
make[1]: Entering directory '/tmp/tmphu8iync1/Integral/Integral-tmp/build'
/usr/bin/cmake -P /tmp/tmphu8iync1/Integral/Integral-tmp/build/CMakeFiles/VerifyGlobs.cmake
/usr/bin/cmake -S/tmp/tmphu8iync1/Integral/Integral-tmp -B/tmp/tmphu8iync1/Integral/Integral-tmp/build --check-build-system CMakeFiles/Makefile.cmake 0
/usr/bin/cmake -E cmake_progress_start /tmp/tmphu8iync1/Integral/Integral-tmp/build/CMakeFiles /tmp/tmphu8iync1/Integral/Integral-tmp/build//CMakeFiles/progress.marks
make  -f CMakeFiles/Makefile2 all
make[2]: Entering directory '/tmp/tmphu8iync1/Integral/Integral-tmp/build'
make  -f preprocess/CMakeFiles/preprocess.dir/build.make preprocess/CMakeFiles/preprocess.dir/depend
make[3]: Entering directory '/tmp/tmphu8iync1/Integral/Integral-tmp/build'
cd /tmp/tmphu8iync1/Integral/Integral-tmp/build && /usr/bin/cmake -E cmake_depends "Unix Makefiles" /tmp/tmphu8iync1/Integral/Integral-tmp /tmp/tmphu8iync1/Integral/Integral-tmp/preprocess /tmp/tmphu8iync1/Integral/Integral-tmp/build /tmp/tmphu8iync1/Integral/Integral-tmp/build/preprocess /tmp/tmphu8iync1/Integral/Integral-tmp/build/preprocess/CMakeFiles/preprocess.dir/DependInfo.cmake --color=
make[3]: Leaving directory '/tmp/tmphu8iync1/Integral/Integral-tmp/build'
make  -f preprocess/CMakeFiles/preprocess.dir/build.make preprocess/CMakeFiles/preprocess.dir/build
make[3]: Entering directory '/tmp/tmphu8iync1/Integral/Integral-tmp/build'
[  3%] Building CXX object preprocess/CMakeFiles/preprocess.dir/net_processing.cc.o
cd /tmp/tmphu8iync1/Integral/Integral-tmp/build/preprocess && /usr/bin/clang++ -DFMT_CONSTEVAL="" -DFMT_HEADER_ONLY -I/tmp/tmphu8iync1/Integral/Integral-tmp/preprocess/../third-party/fathom -I/tmp/tmphu8iync1/Integral/Integral-tmp/preprocess/../third-party/fmt/include -march=native -DBUILD_NATIVE -O3 -DNDEBUG -fconstexpr-steps=100000000 -std=gnu++20 -MD -MT preprocess/CMakeFiles/preprocess.dir/net_processing.cc.o -MF CMakeFiles/preprocess.dir/net_processing.cc.o.d -o CMakeFiles/preprocess.dir/net_processing.cc.o -c /tmp/tmphu8iync1/Integral/Integral-tmp/preprocess/net_processing.cc
[  6%] Linking CXX executable preprocess
cd /tmp/tmphu8iync1/Integral/Integral-tmp/build/preprocess && /usr/bin/cmake -E cmake_link_script CMakeFiles/preprocess.dir/link.txt --verbose=1
/usr/bin/clang++  -march=native -DBUILD_NATIVE -O3 -DNDEBUG CMakeFiles/preprocess.dir/net_processing.cc.o -o preprocess 
make[3]: Leaving directory '/tmp/tmphu8iync1/Integral/Integral-tmp/build'
[  6%] Built target preprocess
make  -f CMakeFiles/run_preprocess.dir/build.make CMakeFiles/run_preprocess.dir/depend
make[3]: Entering directory '/tmp/tmphu8iync1/Integral/Integral-tmp/build'
cd /tmp/tmphu8iync1/Integral/Integral-tmp/build && /usr/bin/cmake -E cmake_depends "Unix Makefiles" /tmp/tmphu8iync1/Integral/Integral-tmp /tmp/tmphu8iync1/Integral/Integral-tmp /tmp/tmphu8iync1/Integral/Integral-tmp/build /tmp/tmphu8iync1/Integral/Integral-tmp/build /tmp/tmphu8iync1/Integral/Integral-tmp/build/CMakeFiles/run_preprocess.dir/DependInfo.cmake --color=
make[3]: Leaving directory '/tmp/tmphu8iync1/Integral/Integral-tmp/build'
make  -f CMakeFiles/run_preprocess.dir/build.make CMakeFiles/run_preprocess.dir/build
make[3]: Entering directory '/tmp/tmphu8iync1/Integral/Integral-tmp/build'
[ 10%] Running net preprocessing
preprocess/preprocess /home/aron/OpenBench/Client/Networks/F586B7C9 /tmp/tmphu8iync1/Integral/Integral-tmp/build/processed.nnue
Preprocessing /home/aron/OpenBench/Client/Networks/F586B7C9
Successfully wrote processed network to /tmp/tmphu8iync1/Integral/Integral-tmp/build/processed.nnue
make[3]: Leaving directory '/tmp/tmphu8iync1/Integral/Integral-tmp/build'
[ 10%] Built target run_preprocess
make  -f CMakeFiles/integral.dir/build.make CMakeFiles/integral.dir/depend
make[3]: Entering directory '/tmp/tmphu8iync1/Integral/Integral-tmp/build'
cd /tmp/tmphu8iync1/Integral/Integral-tmp/build && /usr/bin/cmake -E cmake_depends "Unix Makefiles" /tmp/tmphu8iync1/Integral/Integral-tmp /tmp/tmphu8iync1/Integral/Integral-tmp /tmp/tmphu8iync1/Integral/Integral-tmp/build /tmp/tmphu8iync1/Integral/Integral-tmp/build /tmp/tmphu8iync1/Integral/Integral-tmp/build/CMakeFiles/integral.dir/DependInfo.cmake --color=
make[3]: Leaving directory '/tmp/tmphu8iync1/Integral/Integral-tmp/build'
make  -f CMakeFiles/integral.dir/build.make CMakeFiles/integral.dir/build
make[3]: Entering directory '/tmp/tmphu8iync1/Integral/Integral-tmp/build'
[ 13%] Building CXX object CMakeFiles/integral.dir/src/engine/evaluation/nnue/accumulator.cc.o
[ 16%] Building CXX object CMakeFiles/integral.dir/src/engine/evaluation/nnue/pawn_pair/pawn_pair_features.cc.o
[ 20%] Building CXX object CMakeFiles/integral.dir/src/chess/board.cc.o
[ 23%] Building CXX object CMakeFiles/integral.dir/src/chess/move_gen.cc.o
[ 26%] Building CXX object CMakeFiles/integral.dir/src/engine/search/cuckoo.cc.o
/usr/bin/clang++ -DEVALFILE=\"/tmp/tmphu8iync1/Integral/Integral-tmp/build/processed.nnue\" -DFMT_CONSTEVAL="" -DFMT_HEADER_ONLY -I/tmp/tmphu8iync1/Integral/Integral-tmp/third-party/fathom -I/tmp/tmphu8iync1/Integral/Integral-tmp/third-party/fmt/include -march=native -DBUILD_NATIVE -DUSE_PEXT -pthread -O3 -funroll-loops -DNDEBUG -flto=thin -fconstexpr-steps=100000000 -fprofile-generate -std=gnu++20 -MD -MT CMakeFiles/integral.dir/src/engine/evaluation/nnue/accumulator.cc.o -MF CMakeFiles/integral.dir/src/engine/evaluation/nnue/accumulator.cc.o.d -o CMakeFiles/integral.dir/src/engine/evaluation/nnue/accumulator.cc.o -c /tmp/tmphu8iync1/Integral/Integral-tmp/src/engine/evaluation/nnue/accumulator.cc
[ 33%] Building CXX object CMakeFiles/integral.dir/src/engine/search/move_picker.cc.o
[ 33%] Building CXX object CMakeFiles/integral.dir/src/chess/fen.cc.o
/usr/bin/clang++ -DEVALFILE=\"/tmp/tmphu8iync1/Integral/Integral-tmp/build/processed.nnue\" -DFMT_CONSTEVAL="" -DFMT_HEADER_ONLY -I/tmp/tmphu8iync1/Integral/Integral-tmp/third-party/fathom -I/tmp/tmphu8iync1/Integral/Integral-tmp/third-party/fmt/include -march=native -DBUILD_NATIVE -DUSE_PEXT -pthread -O3 -funroll-loops -DNDEBUG -flto=thin -fconstexpr-steps=100000000 -fprofile-generate -std=gnu++20 -MD -MT CMakeFiles/integral.dir/src/engine/evaluation/nnue/pawn_pair/pawn_pair_features.cc.o -MF CMakeFiles/integral.dir/src/engine/evaluation/nnue/pawn_pair/pawn_pair_features.cc.o.d -o CMakeFiles/integral.dir/src/engine/evaluation/nnue/pawn_pair/pawn_pair_features.cc.o -c /tmp/tmphu8iync1/Integral/Integral-tmp/src/engine/evaluation/nnue/pawn_pair/pawn_pair_features.cc
[ 36%] Building CXX object CMakeFiles/integral.dir/src/engine/evaluation/nnue/threats/threat_features.cc.o
/usr/bin/clang++ -DEVALFILE=\"/tmp/tmphu8iync1/Integral/Integral-tmp/build/processed.nnue\" -DFMT_CONSTEVAL="" -DFMT_HEADER_ONLY -I/tmp/tmphu8iync1/Integral/Integral-tmp/third-party/fathom -I/tmp/tmphu8iync1/Integral/Integral-tmp/third-party/fmt/include -march=native -DBUILD_NATIVE -DUSE_PEXT -pthread -O3 -funroll-loops -DNDEBUG -flto=thin -fconstexpr-steps=100000000 -fprofile-generate -std=gnu++20 -MD -MT CMakeFiles/integral.dir/src/chess/board.cc.o -MF CMakeFiles/integral.dir/src/chess/board.cc.o.d -o CMakeFiles/integral.dir/src/chess/board.cc.o -c /tmp/tmphu8iync1/Integral/Integral-tmp/src/chess/board.cc
/usr/bin/clang++ -DEVALFILE=\"/tmp/tmphu8iync1/Integral/Integral-tmp/build/processed.nnue\" -DFMT_CONSTEVAL="" -DFMT_HEADER_ONLY -I/tmp/tmphu8iync1/Integral/Integral-tmp/third-party/fathom -I/tmp/tmphu8iync1/Integral/Integral-tmp/third-party/fmt/include -march=native -DBUILD_NATIVE -DUSE_PEXT -pthread -O3 -funroll-loops -DNDEBUG -flto=thin -fconstexpr-steps=100000000 -fprofile-generate -std=gnu++20 -MD -MT CMakeFiles/integral.dir/src/chess/move_gen.cc.o -MF CMakeFiles/integral.dir/src/chess/move_gen.cc.o.d -o CMakeFiles/integral.dir/src/chess/move_gen.cc.o -c /tmp/tmphu8iync1/Integral/Integral-tmp/src/chess/move_gen.cc
[ 40%] Building CXX object CMakeFiles/integral.dir/src/data_gen/data_gen.cc.o
[ 43%] Building CXX object CMakeFiles/integral.dir/src/engine/evaluation/nnue/nnue.cc.o
/usr/bin/clang++ -DEVALFILE=\"/tmp/tmphu8iync1/Integral/Integral-tmp/build/processed.nnue\" -DFMT_CONSTEVAL="" -DFMT_HEADER_ONLY -I/tmp/tmphu8iync1/Integral/Integral-tmp/third-party/fathom -I/tmp/tmphu8iync1/Integral/Integral-tmp/third-party/fmt/include -march=native -DBUILD_NATIVE -DUSE_PEXT -pthread -O3 -funroll-loops -DNDEBUG -flto=thin -fconstexpr-steps=100000000 -fprofile-generate -std=gnu++20 -MD -MT CMakeFiles/integral.dir/src/engine/search/move_picker.cc.o -MF CMakeFiles/integral.dir/src/engine/search/move_picker.cc.o.d -o CMakeFiles/integral.dir/src/engine/search/move_picker.cc.o -c /tmp/tmphu8iync1/Integral/Integral-tmp/src/engine/search/move_picker.cc
[ 50%] Building CXX object CMakeFiles/integral.dir/src/engine/evaluation/evaluation.cc.o
[ 50%] Building CXX object CMakeFiles/integral.dir/src/engine/search/syzygy/syzygy.cc.o
/usr/bin/clang++ -DEVALFILE=\"/tmp/tmphu8iync1/Integral/Integral-tmp/build/processed.nnue\" -DFMT_CONSTEVAL="" -DFMT_HEADER_ONLY -I/tmp/tmphu8iync1/Integral/Integral-tmp/third-party/fathom -I/tmp/tmphu8iync1/Integral/Integral-tmp/third-party/fmt/include -march=native -DBUILD_NATIVE -DUSE_PEXT -pthread -O3 -funroll-loops -DNDEBUG -flto=thin -fconstexpr-steps=100000000 -fprofile-generate -std=gnu++20 -MD -MT CMakeFiles/integral.dir/src/engine/search/cuckoo.cc.o -MF CMakeFiles/integral.dir/src/engine/search/cuckoo.cc.o.d -o CMakeFiles/integral.dir/src/engine/search/cuckoo.cc.o -c /tmp/tmphu8iync1/Integral/Integral-tmp/src/engine/search/cuckoo.cc
[ 53%] Building CXX object CMakeFiles/integral.dir/src/chess/move.cc.o
/usr/bin/clang++ -DEVALFILE=\"/tmp/tmphu8iync1/Integral/Integral-tmp/build/processed.nnue\" -DFMT_CONSTEVAL="" -DFMT_HEADER_ONLY -I/tmp/tmphu8iync1/Integral/Integral-tmp/third-party/fathom -I/tmp/tmphu8iync1/Integral/Integral-tmp/third-party/fmt/include -march=native -DBUILD_NATIVE -DUSE_PEXT -pthread -O3 -funroll-loops -DNDEBUG -flto=thin -fconstexpr-steps=100000000 -fprofile-generate -std=gnu++20 -MD -MT CMakeFiles/integral.dir/src/chess/fen.cc.o -MF CMakeFiles/integral.dir/src/chess/fen.cc.o.d -o CMakeFiles/integral.dir/src/chess/fen.cc.o -c /tmp/tmphu8iync1/Integral/Integral-tmp/src/chess/fen.cc
[ 60%] Building CXX object CMakeFiles/integral.dir/src/engine/evaluation/nnue/threat_accumulator.cc.o
[ 60%] Building CXX object CMakeFiles/integral.dir/src/engine/evaluation/nnue/psqt_accumulator.cc.o
/usr/bin/clang++ -DEVALFILE=\"/tmp/tmphu8iync1/Integral/Integral-tmp/build/processed.nnue\" -DFMT_CONSTEVAL="" -DFMT_HEADER_ONLY -I/tmp/tmphu8iync1/Integral/Integral-tmp/third-party/fathom -I/tmp/tmphu8iync1/Integral/Integral-tmp/third-party/fmt/include -march=native -DBUILD_NATIVE -DUSE_PEXT -pthread -O3 -funroll-loops -DNDEBUG -flto=thin -fconstexpr-steps=100000000 -fprofile-generate -std=gnu++20 -MD -MT CMakeFiles/integral.dir/src/engine/evaluation/nnue/threats/threat_features.cc.o -MF CMakeFiles/integral.dir/src/engine/evaluation/nnue/threats/threat_features.cc.o.d -o CMakeFiles/integral.dir/src/engine/evaluation/nnue/threats/threat_features.cc.o -c /tmp/tmphu8iync1/Integral/Integral-tmp/src/engine/evaluation/nnue/threats/threat_features.cc
[ 63%] Building CXX object CMakeFiles/integral.dir/src/engine/search/search.cc.o
/usr/bin/clang++ -DEVALFILE=\"/tmp/tmphu8iync1/Integral/Integral-tmp/build/processed.nnue\" -DFMT_CONSTEVAL="" -DFMT_HEADER_ONLY -I/tmp/tmphu8iync1/Integral/Integral-tmp/third-party/fathom -I/tmp/tmphu8iync1/Integral/Integral-tmp/third-party/fmt/include -march=native -DBUILD_NATIVE -DUSE_PEXT -pthread -O3 -funroll-loops -DNDEBUG -flto=thin -fconstexpr-steps=100000000 -fprofile-generate -std=gnu++20 -MD -MT CMakeFiles/integral.dir/src/data_gen/data_gen.cc.o -MF CMakeFiles/integral.dir/src/data_gen/data_gen.cc.o.d -o CMakeFiles/integral.dir/src/data_gen/data_gen.cc.o -c /tmp/tmphu8iync1/Integral/Integral-tmp/src/data_gen/data_gen.cc
[ 66%] Building CXX object CMakeFiles/integral.dir/src/engine/search/time_mgmt.cc.o
/usr/bin/clang++ -DEVALFILE=\"/tmp/tmphu8iync1/Integral/Integral-tmp/build/processed.nnue\" -DFMT_CONSTEVAL="" -DFMT_HEADER_ONLY -I/tmp/tmphu8iync1/Integral/Integral-tmp/third-party/fathom -I/tmp/tmphu8iync1/Integral/Integral-tmp/third-party/fmt/include -march=native -DBUILD_NATIVE -DUSE_PEXT -pthread -O3 -funroll-loops -DNDEBUG -flto=thin -fconstexpr-steps=100000000 -fprofile-generate -std=gnu++20 -MD -MT CMakeFiles/integral.dir/src/engine/evaluation/nnue/nnue.cc.o -MF CMakeFiles/integral.dir/src/engine/evaluation/nnue/nnue.cc.o.d -o CMakeFiles/integral.dir/src/engine/evaluation/nnue/nnue.cc.o -c /tmp/tmphu8iync1/Integral/Integral-tmp/src/engine/evaluation/nnue/nnue.cc
/usr/bin/clang++ -DEVALFILE=\"/tmp/tmphu8iync1/Integral/Integral-tmp/build/processed.nnue\" -DFMT_CONSTEVAL="" -DFMT_HEADER_ONLY -I/tmp/tmphu8iync1/Integral/Integral-tmp/third-party/fathom -I/tmp/tmphu8iync1/Integral/Integral-tmp/third-party/fmt/include -march=native -DBUILD_NATIVE -DUSE_PEXT -pthread -O3 -funroll-loops -DNDEBUG -flto=thin -fconstexpr-steps=100000000 -fprofile-generate -std=gnu++20 -MD -MT CMakeFiles/integral.dir/src/engine/evaluation/evaluation.cc.o -MF CMakeFiles/integral.dir/src/engine/evaluation/evaluation.cc.o.d -o CMakeFiles/integral.dir/src/engine/evaluation/evaluation.cc.o -c /tmp/tmphu8iync1/Integral/Integral-tmp/src/engine/evaluation/evaluation.cc
/usr/bin/clang++ -DEVALFILE=\"/tmp/tmphu8iync1/Integral/Integral-tmp/build/processed.nnue\" -DFMT_CONSTEVAL="" -DFMT_HEADER_ONLY -I/tmp/tmphu8iync1/Integral/Integral-tmp/third-party/fathom -I/tmp/tmphu8iync1/Integral/Integral-tmp/third-party/fmt/include -march=native -DBUILD_NATIVE -DUSE_PEXT -pthread -O3 -funroll-loops -DNDEBUG -flto=thin -fconstexpr-steps=100000000 -fprofile-generate -std=gnu++20 -MD -MT CMakeFiles/integral.dir/src/chess/move.cc.o -MF CMakeFiles/integral.dir/src/chess/move.cc.o.d -o CMakeFiles/integral.dir/src/chess/move.cc.o -c /tmp/tmphu8iync1/Integral/Integral-tmp/src/chess/move.cc
[ 70%] Building CXX object CMakeFiles/integral.dir/src/engine/search/transpo.cc.o
/usr/bin/clang++ -DEVALFILE=\"/tmp/tmphu8iync1/Integral/Integral-tmp/build/processed.nnue\" -DFMT_CONSTEVAL="" -DFMT_HEADER_ONLY -I/tmp/tmphu8iync1/Integral/Integral-tmp/third-party/fathom -I/tmp/tmphu8iync1/Integral/Integral-tmp/third-party/fmt/include -march=native -DBUILD_NATIVE -DUSE_PEXT -pthread -O3 -funroll-loops -DNDEBUG -flto=thin -fconstexpr-steps=100000000 -fprofile-generate -std=gnu++20 -MD -MT CMakeFiles/integral.dir/src/engine/evaluation/nnue/psqt_accumulator.cc.o -MF CMakeFiles/integral.dir/src/engine/evaluation/nnue/psqt_accumulator.cc.o.d -o CMakeFiles/integral.dir/src/engine/evaluation/nnue/psqt_accumulator.cc.o -c /tmp/tmphu8iync1/Integral/Integral-tmp/src/engine/evaluation/nnue/psqt_accumulator.cc
/usr/bin/clang++ -DEVALFILE=\"/tmp/tmphu8iync1/Integral/Integral-tmp/build/processed.nnue\" -DFMT_CONSTEVAL="" -DFMT_HEADER_ONLY -I/tmp/tmphu8iync1/Integral/Integral-tmp/third-party/fathom -I/tmp/tmphu8iync1/Integral/Integral-tmp/third-party/fmt/include -march=native -DBUILD_NATIVE -DUSE_PEXT -pthread -O3 -funroll-loops -DNDEBUG -flto=thin -fconstexpr-steps=100000000 -fprofile-generate -std=gnu++20 -MD -MT CMakeFiles/integral.dir/src/engine/evaluation/nnue/threat_accumulator.cc.o -MF CMakeFiles/integral.dir/src/engine/evaluation/nnue/threat_accumulator.cc.o.d -o CMakeFiles/integral.dir/src/engine/evaluation/nnue/threat_accumulator.cc.o -c /tmp/tmphu8iync1/Integral/Integral-tmp/src/engine/evaluation/nnue/threat_accumulator.cc
[ 76%] Building CXX object CMakeFiles/integral.dir/src/magics/attacks.cc.o
[ 76%] Building CXX object CMakeFiles/integral.dir/src/engine/uci/uci.cc.o
/usr/bin/clang++ -DEVALFILE=\"/tmp/tmphu8iync1/Integral/Integral-tmp/build/processed.nnue\" -DFMT_CONSTEVAL="" -DFMT_HEADER_ONLY -I/tmp/tmphu8iync1/Integral/Integral-tmp/third-party/fathom -I/tmp/tmphu8iync1/Integral/Integral-tmp/third-party/fmt/include -march=native -DBUILD_NATIVE -DUSE_PEXT -pthread -O3 -funroll-loops -DNDEBUG -flto=thin -fconstexpr-steps=100000000 -fprofile-generate -std=gnu++20 -MD -MT CMakeFiles/integral.dir/src/engine/search/search.cc.o -MF CMakeFiles/integral.dir/src/engine/search/search.cc.o.d -o CMakeFiles/integral.dir/src/engine/search/search.cc.o -c /tmp/tmphu8iync1/Integral/Integral-tmp/src/engine/search/search.cc
/usr/bin/clang++ -DEVALFILE=\"/tmp/tmphu8iync1/Integral/Integral-tmp/build/processed.nnue\" -DFMT_CONSTEVAL="" -DFMT_HEADER_ONLY -I/tmp/tmphu8iync1/Integral/Integral-tmp/third-party/fathom -I/tmp/tmphu8iync1/Integral/Integral-tmp/third-party/fmt/include -march=native -DBUILD_NATIVE -DUSE_PEXT -pthread -O3 -funroll-loops -DNDEBUG -flto=thin -fconstexpr-steps=100000000 -fprofile-generate -std=gnu++20 -MD -MT CMakeFiles/integral.dir/src/engine/search/syzygy/syzygy.cc.o -MF CMakeFiles/integral.dir/src/engine/search/syzygy/syzygy.cc.o.d -o CMakeFiles/integral.dir/src/engine/search/syzygy/syzygy.cc.o -c /tmp/tmphu8iync1/Integral/Integral-tmp/src/engine/search/syzygy/syzygy.cc
/usr/bin/clang++ -DEVALFILE=\"/tmp/tmphu8iync1/Integral/Integral-tmp/build/processed.nnue\" -DFMT_CONSTEVAL="" -DFMT_HEADER_ONLY -I/tmp/tmphu8iync1/Integral/Integral-tmp/third-party/fathom -I/tmp/tmphu8iync1/Integral/Integral-tmp/third-party/fmt/include -march=native -DBUILD_NATIVE -DUSE_PEXT -pthread -O3 -funroll-loops -DNDEBUG -flto=thin -fconstexpr-steps=100000000 -fprofile-generate -std=gnu++20 -MD -MT CMakeFiles/integral.dir/src/engine/search/time_mgmt.cc.o -MF CMakeFiles/integral.dir/src/engine/search/time_mgmt.cc.o.d -o CMakeFiles/integral.dir/src/engine/search/time_mgmt.cc.o -c /tmp/tmphu8iync1/Integral/Integral-tmp/src/engine/search/time_mgmt.cc
[ 80%] Building CXX object CMakeFiles/integral.dir/src/magics/magic_finder.cc.o
[ 86%] Building CXX object CMakeFiles/integral.dir/src/main.cc.o
[ 86%] Building CXX object CMakeFiles/integral.dir/src/tests/bench_test.cc.o
[ 90%] Building CXX object CMakeFiles/integral.dir/src/tests/see_test.cc.o
/usr/bin/clang++ -DEVALFILE=\"/tmp/tmphu8iync1/Integral/Integral-tmp/build/processed.nnue\" -DFMT_CONSTEVAL="" -DFMT_HEADER_ONLY -I/tmp/tmphu8iync1/Integral/Integral-tmp/third-party/fathom -I/tmp/tmphu8iync1/Integral/Integral-tmp/third-party/fmt/include -march=native -DBUILD_NATIVE -DUSE_PEXT -pthread -O3 -funroll-loops -DNDEBUG -flto=thin -fconstexpr-steps=100000000 -fprofile-generate -std=gnu++20 -MD -MT CMakeFiles/integral.dir/src/engine/search/transpo.cc.o -MF CMakeFiles/integral.dir/src/engine/search/transpo.cc.o.d -o CMakeFiles/integral.dir/src/engine/search/transpo.cc.o -c /tmp/tmphu8iync1/Integral/Integral-tmp/src/engine/search/transpo.cc
[ 93%] Building CXX object CMakeFiles/integral.dir/src/tests/perft_test.cc.o
[ 96%] Building C object CMakeFiles/integral.dir/third-party/fathom/tbprobe.c.o
/usr/bin/clang++ -DEVALFILE=\"/tmp/tmphu8iync1/Integral/Integral-tmp/build/processed.nnue\" -DFMT_CONSTEVAL="" -DFMT_HEADER_ONLY -I/tmp/tmphu8iync1/Integral/Integral-tmp/third-party/fathom -I/tmp/tmphu8iync1/Integral/Integral-tmp/third-party/fmt/include -march=native -DBUILD_NATIVE -DUSE_PEXT -pthread -O3 -funroll-loops -DNDEBUG -flto=thin -fconstexpr-steps=100000000 -fprofile-generate -std=gnu++20 -MD -MT CMakeFiles/integral.dir/src/engine/uci/uci.cc.o -MF CMakeFiles/integral.dir/src/engine/uci/uci.cc.o.d -o CMakeFiles/integral.dir/src/engine/uci/uci.cc.o -c /tmp/tmphu8iync1/Integral/Integral-tmp/src/engine/uci/uci.cc
/usr/bin/clang++ -DEVALFILE=\"/tmp/tmphu8iync1/Integral/Integral-tmp/build/processed.nnue\" -DFMT_CONSTEVAL="" -DFMT_HEADER_ONLY -I/tmp/tmphu8iync1/Integral/Integral-tmp/third-party/fathom -I/tmp/tmphu8iync1/Integral/Integral-tmp/third-party/fmt/include -march=native -DBUILD_NATIVE -DUSE_PEXT -pthread -O3 -funroll-loops -DNDEBUG -flto=thin -fconstexpr-steps=100000000 -fprofile-generate -std=gnu++20 -MD -MT CMakeFiles/integral.dir/src/magics/attacks.cc.o -MF CMakeFiles/integral.dir/src/magics/attacks.cc.o.d -o CMakeFiles/integral.dir/src/magics/attacks.cc.o -c /tmp/tmphu8iync1/Integral/Integral-tmp/src/magics/attacks.cc
/usr/bin/clang++ -DEVALFILE=\"/tmp/tmphu8iync1/Integral/Integral-tmp/build/processed.nnue\" -DFMT_CONSTEVAL="" -DFMT_HEADER_ONLY -I/tmp/tmphu8iync1/Integral/Integral-tmp/third-party/fathom -I/tmp/tmphu8iync1/Integral/Integral-tmp/third-party/fmt/include -march=native -DBUILD_NATIVE -DUSE_PEXT -pthread -O3 -funroll-loops -DNDEBUG -flto=thin -fconstexpr-steps=100000000 -fprofile-generate -std=gnu++20 -MD -MT CMakeFiles/integral.dir/src/magics/magic_finder.cc.o -MF CMakeFiles/integral.dir/src/magics/magic_finder.cc.o.d -o CMakeFiles/integral.dir/src/magics/magic_finder.cc.o -c /tmp/tmphu8iync1/Integral/Integral-tmp/src/magics/magic_finder.cc
/usr/bin/clang++ -DEVALFILE=\"/tmp/tmphu8iync1/Integral/Integral-tmp/build/processed.nnue\" -DFMT_CONSTEVAL="" -DFMT_HEADER_ONLY -I/tmp/tmphu8iync1/Integral/Integral-tmp/third-party/fathom -I/tmp/tmphu8iync1/Integral/Integral-tmp/third-party/fmt/include -march=native -DBUILD_NATIVE -DUSE_PEXT -pthread -O3 -funroll-loops -DNDEBUG -flto=thin -fconstexpr-steps=100000000 -fprofile-generate -std=gnu++20 -MD -MT CMakeFiles/integral.dir/src/main.cc.o -MF CMakeFiles/integral.dir/src/main.cc.o.d -o CMakeFiles/integral.dir/src/main.cc.o -c /tmp/tmphu8iync1/Integral/Integral-tmp/src/main.cc
/usr/bin/clang++ -DEVALFILE=\"/tmp/tmphu8iync1/Integral/Integral-tmp/build/processed.nnue\" -DFMT_CONSTEVAL="" -DFMT_HEADER_ONLY -I/tmp/tmphu8iync1/Integral/Integral-tmp/third-party/fathom -I/tmp/tmphu8iync1/Integral/Integral-tmp/third-party/fmt/include -march=native -DBUILD_NATIVE -DUSE_PEXT -pthread -O3 -funroll-loops -DNDEBUG -flto=thin -fconstexpr-steps=100000000 -fprofile-generate -std=gnu++20 -MD -MT CMakeFiles/integral.dir/src/tests/bench_test.cc.o -MF CMakeFiles/integral.dir/src/tests/bench_test.cc.o.d -o CMakeFiles/integral.dir/src/tests/bench_test.cc.o -c /tmp/tmphu8iync1/Integral/Integral-tmp/src/tests/bench_test.cc
/usr/bin/clang++ -DEVALFILE=\"/tmp/tmphu8iync1/Integral/Integral-tmp/build/processed.nnue\" -DFMT_CONSTEVAL="" -DFMT_HEADER_ONLY -I/tmp/tmphu8iync1/Integral/Integral-tmp/third-party/fathom -I/tmp/tmphu8iync1/Integral/Integral-tmp/third-party/fmt/include -march=native -DBUILD_NATIVE -DUSE_PEXT -pthread -O3 -funroll-loops -DNDEBUG -flto=thin -fconstexpr-steps=100000000 -fprofile-generate -std=gnu++20 -MD -MT CMakeFiles/integral.dir/src/tests/perft_test.cc.o -MF CMakeFiles/integral.dir/src/tests/perft_test.cc.o.d -o CMakeFiles/integral.dir/src/tests/perft_test.cc.o -c /tmp/tmphu8iync1/Integral/Integral-tmp/src/tests/perft_test.cc
/usr/bin/clang++ -DEVALFILE=\"/tmp/tmphu8iync1/Integral/Integral-tmp/build/processed.nnue\" -DFMT_CONSTEVAL="" -DFMT_HEADER_ONLY -I/tmp/tmphu8iync1/Integral/Integral-tmp/third-party/fathom -I/tmp/tmphu8iync1/Integral/Integral-tmp/third-party/fmt/include -march=native -DBUILD_NATIVE -DUSE_PEXT -pthread -O3 -funroll-loops -DNDEBUG -flto=thin -fconstexpr-steps=100000000 -fprofile-generate -std=gnu++20 -MD -MT CMakeFiles/integral.dir/src/tests/see_test.cc.o -MF CMakeFiles/integral.dir/src/tests/see_test.cc.o.d -o CMakeFiles/integral.dir/src/tests/see_test.cc.o -c /tmp/tmphu8iync1/Integral/Integral-tmp/src/tests/see_test.cc
/usr/bin/clang -DEVALFILE=\"/tmp/tmphu8iync1/Integral/Integral-tmp/build/processed.nnue\" -DFMT_CONSTEVAL="" -DFMT_HEADER_ONLY -I/tmp/tmphu8iync1/Integral/Integral-tmp/third-party/fathom -I/tmp/tmphu8iync1/Integral/Integral-tmp/third-party/fmt/include -O3 -DNDEBUG -flto=thin -fprofile-generate -MD -MT CMakeFiles/integral.dir/third-party/fathom/tbprobe.c.o -MF CMakeFiles/integral.dir/third-party/fathom/tbprobe.c.o.d -o CMakeFiles/integral.dir/third-party/fathom/tbprobe.c.o -c /tmp/tmphu8iync1/Integral/Integral-tmp/third-party/fathom/tbprobe.c
/tmp/tmphu8iync1/Integral/Integral-tmp/third-party/fathom/tbprobe.c:150:9: warning: 'popcount' macro redefined [-Wmacro-redefined]
#define popcount(x) tb_software_popcount(x)
        ^
/tmp/tmphu8iync1/Integral/Integral-tmp/third-party/fathom/tbprobe.c:130:9: note: previous definition is here
#define popcount(x) __builtin_popcountll((x))
        ^
1 warning generated.
[100%] Linking CXX executable integral
/usr/bin/cmake -E cmake_link_script CMakeFiles/integral.dir/link.txt --verbose=1
/usr/bin/clang++  -march=native -DBUILD_NATIVE -DUSE_PEXT -pthread -O3 -funroll-loops -DNDEBUG -flto=thin -fprofile-generate CMakeFiles/integral.dir/src/chess/board.cc.o CMakeFiles/integral.dir/src/chess/fen.cc.o CMakeFiles/integral.dir/src/chess/move.cc.o CMakeFiles/integral.dir/src/chess/move_gen.cc.o CMakeFiles/integral.dir/src/data_gen/data_gen.cc.o CMakeFiles/integral.dir/src/engine/evaluation/evaluation.cc.o CMakeFiles/integral.dir/src/engine/evaluation/nnue/accumulator.cc.o CMakeFiles/integral.dir/src/engine/evaluation/nnue/nnue.cc.o CMakeFiles/integral.dir/src/engine/evaluation/nnue/pawn_pair/pawn_pair_features.cc.o CMakeFiles/integral.dir/src/engine/evaluation/nnue/psqt_accumulator.cc.o CMakeFiles/integral.dir/src/engine/evaluation/nnue/threat_accumulator.cc.o CMakeFiles/integral.dir/src/engine/evaluation/nnue/threats/threat_features.cc.o CMakeFiles/integral.dir/src/engine/search/cuckoo.cc.o CMakeFiles/integral.dir/src/engine/search/move_picker.cc.o CMakeFiles/integral.dir/src/engine/search/search.cc.o CMakeFiles/integral.dir/src/engine/search/syzygy/syzygy.cc.o CMakeFiles/integral.dir/src/engine/search/time_mgmt.cc.o CMakeFiles/integral.dir/src/engine/search/transpo.cc.o CMakeFiles/integral.dir/src/engine/uci/uci.cc.o CMakeFiles/integral.dir/src/magics/attacks.cc.o CMakeFiles/integral.dir/src/magics/magic_finder.cc.o CMakeFiles/integral.dir/src/main.cc.o CMakeFiles/integral.dir/src/tests/bench_test.cc.o CMakeFiles/integral.dir/src/tests/perft_test.cc.o CMakeFiles/integral.dir/src/tests/see_test.cc.o "CMakeFiles/integral.dir/third-party/fathom/tbprobe.c.o" -o integral 
/usr/bin/ld: cannot find /usr/lib/llvm-14/lib/clang/14.0.6/lib/linux/libclang_rt.profile-x86_64.a: No such file or directory
clang: error: linker command failed with exit code 1 (use -v to see invocation)
make[3]: *** [CMakeFiles/integral.dir/build.make:500: integral] Error 1
make[3]: Leaving directory '/tmp/tmphu8iync1/Integral/Integral-tmp/build'
make[2]: *** [CMakeFiles/Makefile2:132: CMakeFiles/integral.dir/all] Error 2
make[2]: Leaving directory '/tmp/tmphu8iync1/Integral/Integral-tmp/build'
make[1]: *** [Makefile:94: all] Error 2
make[1]: Leaving directory '/tmp/tmphu8iync1/Integral/Integral-tmp/build'
make: *** [Makefile:51: all] Error 2