Building Integral-74BE7E03-C0E127CB with BUILD_NATIVE using g++...
-- The C compiler identification is GNU 15.2.0
-- The CXX compiler identification is GNU 15.2.0
-- Detecting C compiler ABI info
-- Detecting C compiler ABI info - done
-- Check for working C compiler: /usr/bin/gcc - skipped
-- Detecting C compile features
-- Detecting C compile features - done
-- Detecting CXX compiler ABI info
-- Detecting CXX compiler ABI info - done
-- Check for working CXX compiler: /usr/bin/g++ - skipped
-- Detecting CXX compile features
-- Detecting CXX compile features - done
-- Using user-specified EVALFILE: /home/ubuntu/OpenBench/Client/Networks/C0E127CB
-- Checking for BMI2 support in native build...
-- BMI2 (PEXT) support detected and enabled for Zen 3/4 processor
-- Configuring done
-- Generating done
-- Build files have been written to: /tmp/tmpugm1nye3/Integral/Integral-tmp/build
make[1]: Entering directory '/tmp/tmpugm1nye3/Integral/Integral-tmp/build'
/usr/bin/cmake -P /tmp/tmpugm1nye3/Integral/Integral-tmp/build/CMakeFiles/VerifyGlobs.cmake
/usr/bin/cmake -S/tmp/tmpugm1nye3/Integral/Integral-tmp -B/tmp/tmpugm1nye3/Integral/Integral-tmp/build --check-build-system CMakeFiles/Makefile.cmake 0
/usr/bin/cmake -E cmake_progress_start /tmp/tmpugm1nye3/Integral/Integral-tmp/build/CMakeFiles /tmp/tmpugm1nye3/Integral/Integral-tmp/build//CMakeFiles/progress.marks
make -f CMakeFiles/Makefile2 all
make[2]: Entering directory '/tmp/tmpugm1nye3/Integral/Integral-tmp/build'
make -f preprocess/CMakeFiles/preprocess.dir/build.make preprocess/CMakeFiles/preprocess.dir/depend
make[3]: Entering directory '/tmp/tmpugm1nye3/Integral/Integral-tmp/build'
cd /tmp/tmpugm1nye3/Integral/Integral-tmp/build && /usr/bin/cmake -E cmake_depends "Unix Makefiles" /tmp/tmpugm1nye3/Integral/Integral-tmp /tmp/tmpugm1nye3/Integral/Integral-tmp/preprocess /tmp/tmpugm1nye3/Integral/Integral-tmp/build /tmp/tmpugm1nye3/Integral/Integral-tmp/build/preprocess /tmp/tmpugm1nye3/Integral/Integral-tmp/build/preprocess/CMakeFiles/preprocess.dir/DependInfo.cmake --color=
make[3]: Leaving directory '/tmp/tmpugm1nye3/Integral/Integral-tmp/build'
make -f preprocess/CMakeFiles/preprocess.dir/build.make preprocess/CMakeFiles/preprocess.dir/build
make[3]: Entering directory '/tmp/tmpugm1nye3/Integral/Integral-tmp/build'
[ 3%] Building CXX object preprocess/CMakeFiles/preprocess.dir/net_processing.cc.o
cd /tmp/tmpugm1nye3/Integral/Integral-tmp/build/preprocess && /usr/bin/g++ -DFMT_HEADER_ONLY -I/tmp/tmpugm1nye3/Integral/Integral-tmp/preprocess/../third-party/fathom -I/tmp/tmpugm1nye3/Integral/Integral-tmp/preprocess/../third-party/fmt/include -march=native -DBUILD_NATIVE -O3 -DNDEBUG -std=gnu++20 -MD -MT preprocess/CMakeFiles/preprocess.dir/net_processing.cc.o -MF CMakeFiles/preprocess.dir/net_processing.cc.o.d -o CMakeFiles/preprocess.dir/net_processing.cc.o -c /tmp/tmpugm1nye3/Integral/Integral-tmp/preprocess/net_processing.cc
/tmp/tmpugm1nye3/Integral/Integral-tmp/preprocess/net_processing.cc: In function ‘std::unique_ptr<nnue::Network> ProcessNetwork(const std::unique_ptr<nnue::RawNetwork>&)’:
/tmp/tmpugm1nye3/Integral/Integral-tmp/preprocess/net_processing.cc:49:31: warning: ignoring attributes on template argument ‘__m128i’ [-Wignored-attributes]
49 | std::array<__m128i, kNumRegs> regs;
| ^
[ 6%] Linking CXX executable preprocess
cd /tmp/tmpugm1nye3/Integral/Integral-tmp/build/preprocess && /usr/bin/cmake -E cmake_link_script CMakeFiles/preprocess.dir/link.txt --verbose=1
/usr/bin/g++ -march=native -DBUILD_NATIVE -O3 -DNDEBUG CMakeFiles/preprocess.dir/net_processing.cc.o -o preprocess
make[3]: Leaving directory '/tmp/tmpugm1nye3/Integral/Integral-tmp/build'
[ 6%] Built target preprocess
make -f CMakeFiles/run_preprocess.dir/build.make CMakeFiles/run_preprocess.dir/depend
make[3]: Entering directory '/tmp/tmpugm1nye3/Integral/Integral-tmp/build'
cd /tmp/tmpugm1nye3/Integral/Integral-tmp/build && /usr/bin/cmake -E cmake_depends "Unix Makefiles" /tmp/tmpugm1nye3/Integral/Integral-tmp /tmp/tmpugm1nye3/Integral/Integral-tmp /tmp/tmpugm1nye3/Integral/Integral-tmp/build /tmp/tmpugm1nye3/Integral/Integral-tmp/build /tmp/tmpugm1nye3/Integral/Integral-tmp/build/CMakeFiles/run_preprocess.dir/DependInfo.cmake --color=
make[3]: Leaving directory '/tmp/tmpugm1nye3/Integral/Integral-tmp/build'
make -f CMakeFiles/run_preprocess.dir/build.make CMakeFiles/run_preprocess.dir/build
make[3]: Entering directory '/tmp/tmpugm1nye3/Integral/Integral-tmp/build'
[ 10%] Running net preprocessing
preprocess/preprocess /home/ubuntu/OpenBench/Client/Networks/C0E127CB /tmp/tmpugm1nye3/Integral/Integral-tmp/build/processed.nnue
Preprocessing /home/ubuntu/OpenBench/Client/Networks/C0E127CB
Successfully wrote processed network to /tmp/tmpugm1nye3/Integral/Integral-tmp/build/processed.nnue
make[3]: Leaving directory '/tmp/tmpugm1nye3/Integral/Integral-tmp/build'
[ 10%] Built target run_preprocess
make -f CMakeFiles/integral.dir/build.make CMakeFiles/integral.dir/depend
make[3]: Entering directory '/tmp/tmpugm1nye3/Integral/Integral-tmp/build'
cd /tmp/tmpugm1nye3/Integral/Integral-tmp/build && /usr/bin/cmake -E cmake_depends "Unix Makefiles" /tmp/tmpugm1nye3/Integral/Integral-tmp /tmp/tmpugm1nye3/Integral/Integral-tmp /tmp/tmpugm1nye3/Integral/Integral-tmp/build /tmp/tmpugm1nye3/Integral/Integral-tmp/build /tmp/tmpugm1nye3/Integral/Integral-tmp/build/CMakeFiles/integral.dir/DependInfo.cmake --color=
make[3]: Leaving directory '/tmp/tmpugm1nye3/Integral/Integral-tmp/build'
make -f CMakeFiles/integral.dir/build.make CMakeFiles/integral.dir/build
make[3]: Entering directory '/tmp/tmpugm1nye3/Integral/Integral-tmp/build'
[ 13%] Building CXX object CMakeFiles/integral.dir/src/chess/board.cc.o
[ 20%] Building CXX object CMakeFiles/integral.dir/src/chess/move_gen.cc.o
[ 23%] Building CXX object CMakeFiles/integral.dir/src/chess/move.cc.o
[ 20%] Building CXX object CMakeFiles/integral.dir/src/chess/fen.cc.o
[ 33%] Building CXX object CMakeFiles/integral.dir/src/data_gen/data_gen.cc.o
[ 33%] Building CXX object CMakeFiles/integral.dir/src/engine/evaluation/evaluation.cc.o
[ 33%] Building CXX object CMakeFiles/integral.dir/src/engine/evaluation/nnue/accumulator.cc.o
[ 36%] Building CXX object CMakeFiles/integral.dir/src/engine/evaluation/nnue/nnue.cc.o
[ 40%] Building CXX object CMakeFiles/integral.dir/src/engine/evaluation/nnue/psqt_accumulator.cc.o
[ 43%] Building CXX object CMakeFiles/integral.dir/src/engine/evaluation/nnue/pawn_pair/pawn_pair_features.cc.o
/usr/bin/g++ -DEVALFILE=\"/tmp/tmpugm1nye3/Integral/Integral-tmp/build/processed.nnue\" -DFMT_HEADER_ONLY -I/tmp/tmpugm1nye3/Integral/Integral-tmp/third-party/fathom -I/tmp/tmpugm1nye3/Integral/Integral-tmp/third-party/fmt/include -march=native -DBUILD_NATIVE -DUSE_PEXT -pthread -O3 -funroll-loops -DNDEBUG -flto -fno-fat-lto-objects -fprofile-generate -std=gnu++20 -MD -MT CMakeFiles/integral.dir/src/chess/board.cc.o -MF CMakeFiles/integral.dir/src/chess/board.cc.o.d -o CMakeFiles/integral.dir/src/chess/board.cc.o -c /tmp/tmpugm1nye3/Integral/Integral-tmp/src/chess/board.cc
[ 46%] Building CXX object CMakeFiles/integral.dir/src/engine/evaluation/nnue/threats/threat_features.cc.o
/usr/bin/g++ -DEVALFILE=\"/tmp/tmpugm1nye3/Integral/Integral-tmp/build/processed.nnue\" -DFMT_HEADER_ONLY -I/tmp/tmpugm1nye3/Integral/Integral-tmp/third-party/fathom -I/tmp/tmpugm1nye3/Integral/Integral-tmp/third-party/fmt/include -march=native -DBUILD_NATIVE -DUSE_PEXT -pthread -O3 -funroll-loops -DNDEBUG -flto -fno-fat-lto-objects -fprofile-generate -std=gnu++20 -MD -MT CMakeFiles/integral.dir/src/chess/fen.cc.o -MF CMakeFiles/integral.dir/src/chess/fen.cc.o.d -o CMakeFiles/integral.dir/src/chess/fen.cc.o -c /tmp/tmpugm1nye3/Integral/Integral-tmp/src/chess/fen.cc
/usr/bin/g++ -DEVALFILE=\"/tmp/tmpugm1nye3/Integral/Integral-tmp/build/processed.nnue\" -DFMT_HEADER_ONLY -I/tmp/tmpugm1nye3/Integral/Integral-tmp/third-party/fathom -I/tmp/tmpugm1nye3/Integral/Integral-tmp/third-party/fmt/include -march=native -DBUILD_NATIVE -DUSE_PEXT -pthread -O3 -funroll-loops -DNDEBUG -flto -fno-fat-lto-objects -fprofile-generate -std=gnu++20 -MD -MT CMakeFiles/integral.dir/src/chess/move.cc.o -MF CMakeFiles/integral.dir/src/chess/move.cc.o.d -o CMakeFiles/integral.dir/src/chess/move.cc.o -c /tmp/tmpugm1nye3/Integral/Integral-tmp/src/chess/move.cc
[ 50%] Building CXX object CMakeFiles/integral.dir/src/engine/search/syzygy/syzygy.cc.o
/usr/bin/g++ -DEVALFILE=\"/tmp/tmpugm1nye3/Integral/Integral-tmp/build/processed.nnue\" -DFMT_HEADER_ONLY -I/tmp/tmpugm1nye3/Integral/Integral-tmp/third-party/fathom -I/tmp/tmpugm1nye3/Integral/Integral-tmp/third-party/fmt/include -march=native -DBUILD_NATIVE -DUSE_PEXT -pthread -O3 -funroll-loops -DNDEBUG -flto -fno-fat-lto-objects -fprofile-generate -std=gnu++20 -MD -MT CMakeFiles/integral.dir/src/chess/move_gen.cc.o -MF CMakeFiles/integral.dir/src/chess/move_gen.cc.o.d -o CMakeFiles/integral.dir/src/chess/move_gen.cc.o -c /tmp/tmpugm1nye3/Integral/Integral-tmp/src/chess/move_gen.cc
/usr/bin/g++ -DEVALFILE=\"/tmp/tmpugm1nye3/Integral/Integral-tmp/build/processed.nnue\" -DFMT_HEADER_ONLY -I/tmp/tmpugm1nye3/Integral/Integral-tmp/third-party/fathom -I/tmp/tmpugm1nye3/Integral/Integral-tmp/third-party/fmt/include -march=native -DBUILD_NATIVE -DUSE_PEXT -pthread -O3 -funroll-loops -DNDEBUG -flto -fno-fat-lto-objects -fprofile-generate -std=gnu++20 -MD -MT CMakeFiles/integral.dir/src/data_gen/data_gen.cc.o -MF CMakeFiles/integral.dir/src/data_gen/data_gen.cc.o.d -o CMakeFiles/integral.dir/src/data_gen/data_gen.cc.o -c /tmp/tmpugm1nye3/Integral/Integral-tmp/src/data_gen/data_gen.cc
/usr/bin/g++ -DEVALFILE=\"/tmp/tmpugm1nye3/Integral/Integral-tmp/build/processed.nnue\" -DFMT_HEADER_ONLY -I/tmp/tmpugm1nye3/Integral/Integral-tmp/third-party/fathom -I/tmp/tmpugm1nye3/Integral/Integral-tmp/third-party/fmt/include -march=native -DBUILD_NATIVE -DUSE_PEXT -pthread -O3 -funroll-loops -DNDEBUG -flto -fno-fat-lto-objects -fprofile-generate -std=gnu++20 -MD -MT CMakeFiles/integral.dir/src/engine/evaluation/evaluation.cc.o -MF CMakeFiles/integral.dir/src/engine/evaluation/evaluation.cc.o.d -o CMakeFiles/integral.dir/src/engine/evaluation/evaluation.cc.o -c /tmp/tmpugm1nye3/Integral/Integral-tmp/src/engine/evaluation/evaluation.cc
/usr/bin/g++ -DEVALFILE=\"/tmp/tmpugm1nye3/Integral/Integral-tmp/build/processed.nnue\" -DFMT_HEADER_ONLY -I/tmp/tmpugm1nye3/Integral/Integral-tmp/third-party/fathom -I/tmp/tmpugm1nye3/Integral/Integral-tmp/third-party/fmt/include -march=native -DBUILD_NATIVE -DUSE_PEXT -pthread -O3 -funroll-loops -DNDEBUG -flto -fno-fat-lto-objects -fprofile-generate -std=gnu++20 -MD -MT CMakeFiles/integral.dir/src/engine/evaluation/nnue/accumulator.cc.o -MF CMakeFiles/integral.dir/src/engine/evaluation/nnue/accumulator.cc.o.d -o CMakeFiles/integral.dir/src/engine/evaluation/nnue/accumulator.cc.o -c /tmp/tmpugm1nye3/Integral/Integral-tmp/src/engine/evaluation/nnue/accumulator.cc
[ 56%] Building CXX object CMakeFiles/integral.dir/src/engine/search/search.cc.o
[ 60%] Building CXX object CMakeFiles/integral.dir/src/engine/evaluation/nnue/threat_accumulator.cc.o
[ 60%] Building CXX object CMakeFiles/integral.dir/src/engine/search/move_picker.cc.o
/usr/bin/g++ -DEVALFILE=\"/tmp/tmpugm1nye3/Integral/Integral-tmp/build/processed.nnue\" -DFMT_HEADER_ONLY -I/tmp/tmpugm1nye3/Integral/Integral-tmp/third-party/fathom -I/tmp/tmpugm1nye3/Integral/Integral-tmp/third-party/fmt/include -march=native -DBUILD_NATIVE -DUSE_PEXT -pthread -O3 -funroll-loops -DNDEBUG -flto -fno-fat-lto-objects -fprofile-generate -std=gnu++20 -MD -MT CMakeFiles/integral.dir/src/engine/evaluation/nnue/nnue.cc.o -MF CMakeFiles/integral.dir/src/engine/evaluation/nnue/nnue.cc.o.d -o CMakeFiles/integral.dir/src/engine/evaluation/nnue/nnue.cc.o -c /tmp/tmpugm1nye3/Integral/Integral-tmp/src/engine/evaluation/nnue/nnue.cc
/usr/bin/g++ -DEVALFILE=\"/tmp/tmpugm1nye3/Integral/Integral-tmp/build/processed.nnue\" -DFMT_HEADER_ONLY -I/tmp/tmpugm1nye3/Integral/Integral-tmp/third-party/fathom -I/tmp/tmpugm1nye3/Integral/Integral-tmp/third-party/fmt/include -march=native -DBUILD_NATIVE -DUSE_PEXT -pthread -O3 -funroll-loops -DNDEBUG -flto -fno-fat-lto-objects -fprofile-generate -std=gnu++20 -MD -MT CMakeFiles/integral.dir/src/engine/evaluation/nnue/pawn_pair/pawn_pair_features.cc.o -MF CMakeFiles/integral.dir/src/engine/evaluation/nnue/pawn_pair/pawn_pair_features.cc.o.d -o CMakeFiles/integral.dir/src/engine/evaluation/nnue/pawn_pair/pawn_pair_features.cc.o -c /tmp/tmpugm1nye3/Integral/Integral-tmp/src/engine/evaluation/nnue/pawn_pair/pawn_pair_features.cc
/usr/bin/g++ -DEVALFILE=\"/tmp/tmpugm1nye3/Integral/Integral-tmp/build/processed.nnue\" -DFMT_HEADER_ONLY -I/tmp/tmpugm1nye3/Integral/Integral-tmp/third-party/fathom -I/tmp/tmpugm1nye3/Integral/Integral-tmp/third-party/fmt/include -march=native -DBUILD_NATIVE -DUSE_PEXT -pthread -O3 -funroll-loops -DNDEBUG -flto -fno-fat-lto-objects -fprofile-generate -std=gnu++20 -MD -MT CMakeFiles/integral.dir/src/engine/evaluation/nnue/psqt_accumulator.cc.o -MF CMakeFiles/integral.dir/src/engine/evaluation/nnue/psqt_accumulator.cc.o.d -o CMakeFiles/integral.dir/src/engine/evaluation/nnue/psqt_accumulator.cc.o -c /tmp/tmpugm1nye3/Integral/Integral-tmp/src/engine/evaluation/nnue/psqt_accumulator.cc
/usr/bin/g++ -DEVALFILE=\"/tmp/tmpugm1nye3/Integral/Integral-tmp/build/processed.nnue\" -DFMT_HEADER_ONLY -I/tmp/tmpugm1nye3/Integral/Integral-tmp/third-party/fathom -I/tmp/tmpugm1nye3/Integral/Integral-tmp/third-party/fmt/include -march=native -DBUILD_NATIVE -DUSE_PEXT -pthread -O3 -funroll-loops -DNDEBUG -flto -fno-fat-lto-objects -fprofile-generate -std=gnu++20 -MD -MT CMakeFiles/integral.dir/src/engine/evaluation/nnue/threat_accumulator.cc.o -MF CMakeFiles/integral.dir/src/engine/evaluation/nnue/threat_accumulator.cc.o.d -o CMakeFiles/integral.dir/src/engine/evaluation/nnue/threat_accumulator.cc.o -c /tmp/tmpugm1nye3/Integral/Integral-tmp/src/engine/evaluation/nnue/threat_accumulator.cc
[ 73%] Building CXX object CMakeFiles/integral.dir/src/magics/attacks.cc.o
[ 73%] Building CXX object CMakeFiles/integral.dir/src/engine/search/transpo.cc.o
[ 73%] Building CXX object CMakeFiles/integral.dir/src/engine/search/cuckoo.cc.o
[ 76%] Building CXX object CMakeFiles/integral.dir/src/main.cc.o
/usr/bin/g++ -DEVALFILE=\"/tmp/tmpugm1nye3/Integral/Integral-tmp/build/processed.nnue\" -DFMT_HEADER_ONLY -I/tmp/tmpugm1nye3/Integral/Integral-tmp/third-party/fathom -I/tmp/tmpugm1nye3/Integral/Integral-tmp/third-party/fmt/include -march=native -DBUILD_NATIVE -DUSE_PEXT -pthread -O3 -funroll-loops -DNDEBUG -flto -fno-fat-lto-objects -fprofile-generate -std=gnu++20 -MD -MT CMakeFiles/integral.dir/src/engine/evaluation/nnue/threats/threat_features.cc.o -MF CMakeFiles/integral.dir/src/engine/evaluation/nnue/threats/threat_features.cc.o.d -o CMakeFiles/integral.dir/src/engine/evaluation/nnue/threats/threat_features.cc.o -c /tmp/tmpugm1nye3/Integral/Integral-tmp/src/engine/evaluation/nnue/threats/threat_features.cc
[ 73%] Building CXX object CMakeFiles/integral.dir/src/engine/uci/uci.cc.o
/usr/bin/g++ -DEVALFILE=\"/tmp/tmpugm1nye3/Integral/Integral-tmp/build/processed.nnue\" -DFMT_HEADER_ONLY -I/tmp/tmpugm1nye3/Integral/Integral-tmp/third-party/fathom -I/tmp/tmpugm1nye3/Integral/Integral-tmp/third-party/fmt/include -march=native -DBUILD_NATIVE -DUSE_PEXT -pthread -O3 -funroll-loops -DNDEBUG -flto -fno-fat-lto-objects -fprofile-generate -std=gnu++20 -MD -MT CMakeFiles/integral.dir/src/engine/search/move_picker.cc.o -MF CMakeFiles/integral.dir/src/engine/search/move_picker.cc.o.d -o CMakeFiles/integral.dir/src/engine/search/move_picker.cc.o -c /tmp/tmpugm1nye3/Integral/Integral-tmp/src/engine/search/move_picker.cc
[ 80%] Building CXX object CMakeFiles/integral.dir/src/magics/magic_finder.cc.o
/usr/bin/g++ -DEVALFILE=\"/tmp/tmpugm1nye3/Integral/Integral-tmp/build/processed.nnue\" -DFMT_HEADER_ONLY -I/tmp/tmpugm1nye3/Integral/Integral-tmp/third-party/fathom -I/tmp/tmpugm1nye3/Integral/Integral-tmp/third-party/fmt/include -march=native -DBUILD_NATIVE -DUSE_PEXT -pthread -O3 -funroll-loops -DNDEBUG -flto -fno-fat-lto-objects -fprofile-generate -std=gnu++20 -MD -MT CMakeFiles/integral.dir/src/engine/search/search.cc.o -MF CMakeFiles/integral.dir/src/engine/search/search.cc.o.d -o CMakeFiles/integral.dir/src/engine/search/search.cc.o -c /tmp/tmpugm1nye3/Integral/Integral-tmp/src/engine/search/search.cc
/usr/bin/g++ -DEVALFILE=\"/tmp/tmpugm1nye3/Integral/Integral-tmp/build/processed.nnue\" -DFMT_HEADER_ONLY -I/tmp/tmpugm1nye3/Integral/Integral-tmp/third-party/fathom -I/tmp/tmpugm1nye3/Integral/Integral-tmp/third-party/fmt/include -march=native -DBUILD_NATIVE -DUSE_PEXT -pthread -O3 -funroll-loops -DNDEBUG -flto -fno-fat-lto-objects -fprofile-generate -std=gnu++20 -MD -MT CMakeFiles/integral.dir/src/engine/search/syzygy/syzygy.cc.o -MF CMakeFiles/integral.dir/src/engine/search/syzygy/syzygy.cc.o.d -o CMakeFiles/integral.dir/src/engine/search/syzygy/syzygy.cc.o -c /tmp/tmpugm1nye3/Integral/Integral-tmp/src/engine/search/syzygy/syzygy.cc
[ 83%] Building CXX object CMakeFiles/integral.dir/src/engine/search/time_mgmt.cc.o
/usr/bin/g++ -DEVALFILE=\"/tmp/tmpugm1nye3/Integral/Integral-tmp/build/processed.nnue\" -DFMT_HEADER_ONLY -I/tmp/tmpugm1nye3/Integral/Integral-tmp/third-party/fathom -I/tmp/tmpugm1nye3/Integral/Integral-tmp/third-party/fmt/include -march=native -DBUILD_NATIVE -DUSE_PEXT -pthread -O3 -funroll-loops -DNDEBUG -flto -fno-fat-lto-objects -fprofile-generate -std=gnu++20 -MD -MT CMakeFiles/integral.dir/src/engine/search/cuckoo.cc.o -MF CMakeFiles/integral.dir/src/engine/search/cuckoo.cc.o.d -o CMakeFiles/integral.dir/src/engine/search/cuckoo.cc.o -c /tmp/tmpugm1nye3/Integral/Integral-tmp/src/engine/search/cuckoo.cc
/usr/bin/g++ -DEVALFILE=\"/tmp/tmpugm1nye3/Integral/Integral-tmp/build/processed.nnue\" -DFMT_HEADER_ONLY -I/tmp/tmpugm1nye3/Integral/Integral-tmp/third-party/fathom -I/tmp/tmpugm1nye3/Integral/Integral-tmp/third-party/fmt/include -march=native -DBUILD_NATIVE -DUSE_PEXT -pthread -O3 -funroll-loops -DNDEBUG -flto -fno-fat-lto-objects -fprofile-generate -std=gnu++20 -MD -MT CMakeFiles/integral.dir/src/engine/search/time_mgmt.cc.o -MF CMakeFiles/integral.dir/src/engine/search/time_mgmt.cc.o.d -o CMakeFiles/integral.dir/src/engine/search/time_mgmt.cc.o -c /tmp/tmpugm1nye3/Integral/Integral-tmp/src/engine/search/time_mgmt.cc
/usr/bin/g++ -DEVALFILE=\"/tmp/tmpugm1nye3/Integral/Integral-tmp/build/processed.nnue\" -DFMT_HEADER_ONLY -I/tmp/tmpugm1nye3/Integral/Integral-tmp/third-party/fathom -I/tmp/tmpugm1nye3/Integral/Integral-tmp/third-party/fmt/include -march=native -DBUILD_NATIVE -DUSE_PEXT -pthread -O3 -funroll-loops -DNDEBUG -flto -fno-fat-lto-objects -fprofile-generate -std=gnu++20 -MD -MT CMakeFiles/integral.dir/src/engine/search/transpo.cc.o -MF CMakeFiles/integral.dir/src/engine/search/transpo.cc.o.d -o CMakeFiles/integral.dir/src/engine/search/transpo.cc.o -c /tmp/tmpugm1nye3/Integral/Integral-tmp/src/engine/search/transpo.cc
/usr/bin/g++ -DEVALFILE=\"/tmp/tmpugm1nye3/Integral/Integral-tmp/build/processed.nnue\" -DFMT_HEADER_ONLY -I/tmp/tmpugm1nye3/Integral/Integral-tmp/third-party/fathom -I/tmp/tmpugm1nye3/Integral/Integral-tmp/third-party/fmt/include -march=native -DBUILD_NATIVE -DUSE_PEXT -pthread -O3 -funroll-loops -DNDEBUG -flto -fno-fat-lto-objects -fprofile-generate -std=gnu++20 -MD -MT CMakeFiles/integral.dir/src/engine/uci/uci.cc.o -MF CMakeFiles/integral.dir/src/engine/uci/uci.cc.o.d -o CMakeFiles/integral.dir/src/engine/uci/uci.cc.o -c /tmp/tmpugm1nye3/Integral/Integral-tmp/src/engine/uci/uci.cc
/usr/bin/g++ -DEVALFILE=\"/tmp/tmpugm1nye3/Integral/Integral-tmp/build/processed.nnue\" -DFMT_HEADER_ONLY -I/tmp/tmpugm1nye3/Integral/Integral-tmp/third-party/fathom -I/tmp/tmpugm1nye3/Integral/Integral-tmp/third-party/fmt/include -march=native -DBUILD_NATIVE -DUSE_PEXT -pthread -O3 -funroll-loops -DNDEBUG -flto -fno-fat-lto-objects -fprofile-generate -std=gnu++20 -MD -MT CMakeFiles/integral.dir/src/magics/attacks.cc.o -MF CMakeFiles/integral.dir/src/magics/attacks.cc.o.d -o CMakeFiles/integral.dir/src/magics/attacks.cc.o -c /tmp/tmpugm1nye3/Integral/Integral-tmp/src/magics/attacks.cc
/usr/bin/g++ -DEVALFILE=\"/tmp/tmpugm1nye3/Integral/Integral-tmp/build/processed.nnue\" -DFMT_HEADER_ONLY -I/tmp/tmpugm1nye3/Integral/Integral-tmp/third-party/fathom -I/tmp/tmpugm1nye3/Integral/Integral-tmp/third-party/fmt/include -march=native -DBUILD_NATIVE -DUSE_PEXT -pthread -O3 -funroll-loops -DNDEBUG -flto -fno-fat-lto-objects -fprofile-generate -std=gnu++20 -MD -MT CMakeFiles/integral.dir/src/magics/magic_finder.cc.o -MF CMakeFiles/integral.dir/src/magics/magic_finder.cc.o.d -o CMakeFiles/integral.dir/src/magics/magic_finder.cc.o -c /tmp/tmpugm1nye3/Integral/Integral-tmp/src/magics/magic_finder.cc
/usr/bin/g++ -DEVALFILE=\"/tmp/tmpugm1nye3/Integral/Integral-tmp/build/processed.nnue\" -DFMT_HEADER_ONLY -I/tmp/tmpugm1nye3/Integral/Integral-tmp/third-party/fathom -I/tmp/tmpugm1nye3/Integral/Integral-tmp/third-party/fmt/include -march=native -DBUILD_NATIVE -DUSE_PEXT -pthread -O3 -funroll-loops -DNDEBUG -flto -fno-fat-lto-objects -fprofile-generate -std=gnu++20 -MD -MT CMakeFiles/integral.dir/src/main.cc.o -MF CMakeFiles/integral.dir/src/main.cc.o.d -o CMakeFiles/integral.dir/src/main.cc.o -c /tmp/tmpugm1nye3/Integral/Integral-tmp/src/main.cc
[ 86%] Building CXX object CMakeFiles/integral.dir/src/tests/bench_test.cc.o
/usr/bin/g++ -DEVALFILE=\"/tmp/tmpugm1nye3/Integral/Integral-tmp/build/processed.nnue\" -DFMT_HEADER_ONLY -I/tmp/tmpugm1nye3/Integral/Integral-tmp/third-party/fathom -I/tmp/tmpugm1nye3/Integral/Integral-tmp/third-party/fmt/include -march=native -DBUILD_NATIVE -DUSE_PEXT -pthread -O3 -funroll-loops -DNDEBUG -flto -fno-fat-lto-objects -fprofile-generate -std=gnu++20 -MD -MT CMakeFiles/integral.dir/src/tests/bench_test.cc.o -MF CMakeFiles/integral.dir/src/tests/bench_test.cc.o.d -o CMakeFiles/integral.dir/src/tests/bench_test.cc.o -c /tmp/tmpugm1nye3/Integral/Integral-tmp/src/tests/bench_test.cc
[ 90%] Building CXX object CMakeFiles/integral.dir/src/tests/perft_test.cc.o
/usr/bin/g++ -DEVALFILE=\"/tmp/tmpugm1nye3/Integral/Integral-tmp/build/processed.nnue\" -DFMT_HEADER_ONLY -I/tmp/tmpugm1nye3/Integral/Integral-tmp/third-party/fathom -I/tmp/tmpugm1nye3/Integral/Integral-tmp/third-party/fmt/include -march=native -DBUILD_NATIVE -DUSE_PEXT -pthread -O3 -funroll-loops -DNDEBUG -flto -fno-fat-lto-objects -fprofile-generate -std=gnu++20 -MD -MT CMakeFiles/integral.dir/src/tests/perft_test.cc.o -MF CMakeFiles/integral.dir/src/tests/perft_test.cc.o.d -o CMakeFiles/integral.dir/src/tests/perft_test.cc.o -c /tmp/tmpugm1nye3/Integral/Integral-tmp/src/tests/perft_test.cc
[ 93%] Building CXX object CMakeFiles/integral.dir/src/tests/see_test.cc.o
[ 96%] Building C object CMakeFiles/integral.dir/third-party/fathom/tbprobe.c.o
/usr/bin/gcc -DEVALFILE=\"/tmp/tmpugm1nye3/Integral/Integral-tmp/build/processed.nnue\" -DFMT_HEADER_ONLY -I/tmp/tmpugm1nye3/Integral/Integral-tmp/third-party/fathom -I/tmp/tmpugm1nye3/Integral/Integral-tmp/third-party/fmt/include -O3 -DNDEBUG -flto -fno-fat-lto-objects -fprofile-generate -MD -MT CMakeFiles/integral.dir/third-party/fathom/tbprobe.c.o -MF CMakeFiles/integral.dir/third-party/fathom/tbprobe.c.o.d -o CMakeFiles/integral.dir/third-party/fathom/tbprobe.c.o -c /tmp/tmpugm1nye3/Integral/Integral-tmp/third-party/fathom/tbprobe.c
/usr/bin/g++ -DEVALFILE=\"/tmp/tmpugm1nye3/Integral/Integral-tmp/build/processed.nnue\" -DFMT_HEADER_ONLY -I/tmp/tmpugm1nye3/Integral/Integral-tmp/third-party/fathom -I/tmp/tmpugm1nye3/Integral/Integral-tmp/third-party/fmt/include -march=native -DBUILD_NATIVE -DUSE_PEXT -pthread -O3 -funroll-loops -DNDEBUG -flto -fno-fat-lto-objects -fprofile-generate -std=gnu++20 -MD -MT CMakeFiles/integral.dir/src/tests/see_test.cc.o -MF CMakeFiles/integral.dir/src/tests/see_test.cc.o.d -o CMakeFiles/integral.dir/src/tests/see_test.cc.o -c /tmp/tmpugm1nye3/Integral/Integral-tmp/src/tests/see_test.cc
/tmp/tmpugm1nye3/Integral/Integral-tmp/third-party/fathom/tbprobe.c:150:9: warning: ‘popcount’ redefined
150 | #define popcount(x) tb_software_popcount(x)
| ^~~~~~~~
/tmp/tmpugm1nye3/Integral/Integral-tmp/third-party/fathom/tbprobe.c:130:9: note: this is the location of the previous definition
130 | #define popcount(x) __builtin_popcountll((x))
| ^~~~~~~~
/tmp/tmpugm1nye3/Integral/Integral-tmp/src/engine/evaluation/nnue/nnue.cc:18:26: warning: missing terminating " character
18 | std::fprintf(stderr, "evals=%llu cycles/eval: apply=%.0f transform=%.0f l1=%.0f head=%.0f nnz_groups=%.1f active=%.1f
| ^
/tmp/tmpugm1nye3/Integral/Integral-tmp/src/engine/evaluation/nnue/nnue.cc:18:26: error: missing terminating " character
18 | std::fprintf(stderr, "evals=%llu cycles/eval: apply=%.0f transform=%.0f l1=%.0f head=%.0f nnz_groups=%.1f active=%.1f
| ^~~~~~~~~~~~~~~~~~~~~~~~~~~~~~~~~~~~~~~~~~~~~~~~~~~~~~~~~~~~~~~~~~~~~~~~~~~~~~~~~~~~~~~~~~~~~~~~~~
/tmp/tmpugm1nye3/Integral/Integral-tmp/src/engine/evaluation/nnue/nnue.cc:19:1: warning: missing terminating " character
19 | ",
| ^
/tmp/tmpugm1nye3/Integral/Integral-tmp/src/engine/evaluation/nnue/nnue.cc:19:1: error: missing terminating " character
19 | ",
| ^~
/tmp/tmpugm1nye3/Integral/Integral-tmp/src/engine/evaluation/nnue/nnue.cc:21:26: warning: missing terminating " character
21 | std::fprintf(stderr, "share of wall time: apply=%.1f%% transform=%.1f%% l1=%.1f%% head=%.1f%%
| ^
/tmp/tmpugm1nye3/Integral/Integral-tmp/src/engine/evaluation/nnue/nnue.cc:21:26: error: missing terminating " character
21 | std::fprintf(stderr, "share of wall time: apply=%.1f%% transform=%.1f%% l1=%.1f%% head=%.1f%%
| ^~~~~~~~~~~~~~~~~~~~~~~~~~~~~~~~~~~~~~~~~~~~~~~~~~~~~~~~~~~~~~~~~~~~~~~~
/tmp/tmpugm1nye3/Integral/Integral-tmp/src/engine/evaluation/nnue/nnue.cc:22:1: warning: missing terminating " character
22 | ",
| ^
/tmp/tmpugm1nye3/Integral/Integral-tmp/src/engine/evaluation/nnue/nnue.cc:22:1: error: missing terminating " character
22 | ",
| ^~
/tmp/tmpugm1nye3/Integral/Integral-tmp/src/engine/evaluation/nnue/nnue.cc: In destructor ‘{anonymous}::ProfStats::~ProfStats()’:
/tmp/tmpugm1nye3/Integral/Integral-tmp/src/engine/evaluation/nnue/nnue.cc:20:7: error: invalid conversion from ‘long long unsigned int’ to ‘const char*’ [-fpermissive]
20 | (unsigned long long)evals, apply/e, transform/e, l1/e, head/e, nnz/e, active/e);
| ^~~~~~~~~~~~~~~~~~~~~~~~~
| |
| long long unsigned int
In file included from /usr/include/stdio.h:894,
from /usr/include/c++/15/cstdio:47,
from /usr/include/c++/15/ext/string_conversions.h:47,
from /usr/include/c++/15/bits/basic_string.h:4442,
from /usr/include/c++/15/string:56,
from /usr/include/c++/15/bits/locale_classes.h:42,
from /usr/include/c++/15/bits/ios_base.h:43,
from /usr/include/c++/15/ios:46,
from /usr/include/c++/15/bits/ostream.h:43,
from /usr/include/c++/15/bits/unique_ptr.h:42,
from /usr/include/c++/15/memory:80,
from /tmp/tmpugm1nye3/Integral/Integral-tmp/src/engine/evaluation/nnue/../../../../shared/nnue/../../src/utils/types.h:7,
from /tmp/tmpugm1nye3/Integral/Integral-tmp/src/engine/evaluation/nnue/../../../../shared/nnue/../simd.h:12,
from /tmp/tmpugm1nye3/Integral/Integral-tmp/src/engine/evaluation/nnue/../../../../shared/nnue/definitions.h:7,
from /tmp/tmpugm1nye3/Integral/Integral-tmp/src/engine/evaluation/nnue/nnue.h:5,
from /tmp/tmpugm1nye3/Integral/Integral-tmp/src/engine/evaluation/nnue/nnue.cc:1:
/usr/include/x86_64-linux-gnu/bits/stdio2.h:103:60: note: initializing argument 2 of ‘int fprintf(FILE*, const char*, ...)’
103 | fprintf (FILE *__restrict __stream, const char *__restrict __fmt, ...)
| ~~~~~~~~~~~~~~~~~~~~~~~^~~~~
/tmp/tmpugm1nye3/Integral/Integral-tmp/src/engine/evaluation/nnue/nnue.cc:23:19: error: cannot convert ‘double’ to ‘const char*’
23 | 100*apply/hz/secs, 100*transform/hz/secs, 100*l1/hz/secs, 100*head/hz/secs);
| ~~~~~~~~~~~~^~~~~
| |
| double
/usr/include/x86_64-linux-gnu/bits/stdio2.h:103:60: note: initializing argument 2 of ‘int fprintf(FILE*, const char*, ...)’
103 | fprintf (FILE *__restrict __stream, const char *__restrict __fmt, ...)
| ~~~~~~~~~~~~~~~~~~~~~~~^~~~~
In file included from /tmp/tmpugm1nye3/Integral/Integral-tmp/src/data_gen/data_gen.cc:12:
/tmp/tmpugm1nye3/Integral/Integral-tmp/src/data_gen/format/binpack.h:69:15: warning: ignoring packed attribute because of unpacked non-POD field ‘data_gen::format::U4Array<32> data_gen::format::MarlinChessBoard::pieces’
69 | U4Array<32> pieces;
| ^~~~~~
make[3]: *** [CMakeFiles/integral.dir/build.make:177: CMakeFiles/integral.dir/src/engine/evaluation/nnue/nnue.cc.o] Error 1
make[3]: *** Waiting for unfinished jobs....
make[3]: Leaving directory '/tmp/tmpugm1nye3/Integral/Integral-tmp/build'
make[2]: *** [CMakeFiles/Makefile2:132: CMakeFiles/integral.dir/all] Error 2
make[2]: Leaving directory '/tmp/tmpugm1nye3/Integral/Integral-tmp/build'
make[1]: *** [Makefile:94: all] Error 2
make[1]: Leaving directory '/tmp/tmpugm1nye3/Integral/Integral-tmp/build'
make: *** [Makefile:51: all] Error 2