Building Integral-CEE0FF1C-F586B7C9 with BUILD_NATIVE using g++...
-- The C compiler identification is GNU 13.3.0
-- The CXX compiler identification is GNU 13.3.0
-- Detecting C compiler ABI info
-- Detecting C compiler ABI info - done
-- Check for working C compiler: /usr/bin/gcc - skipped
-- Detecting C compile features
-- Detecting C compile features - done
-- Detecting CXX compiler ABI info
-- Detecting CXX compiler ABI info - done
-- Check for working CXX compiler: /usr/bin/g++ - skipped
-- Detecting CXX compile features
-- Detecting CXX compile features - done
-- Using user-specified EVALFILE: /workspace/OpenBench/Client/Networks/F586B7C9
-- policy.pn already exists. Skipping download.
-- Checking for BMI2 support in native build...
-- BMI2 (PEXT) support detected and enabled for Zen 3/4 processor
-- Configuring done (0.9s)
-- Generating done (0.0s)
-- Build files have been written to: /tmp/tmp462flm0t/Integral/Integral-tmp/build
make[1]: Entering directory '/tmp/tmp462flm0t/Integral/Integral-tmp/build'
/usr/bin/cmake -P /tmp/tmp462flm0t/Integral/Integral-tmp/build/CMakeFiles/VerifyGlobs.cmake
/usr/bin/cmake -S/tmp/tmp462flm0t/Integral/Integral-tmp -B/tmp/tmp462flm0t/Integral/Integral-tmp/build --check-build-system CMakeFiles/Makefile.cmake 0
/usr/bin/cmake -E cmake_progress_start /tmp/tmp462flm0t/Integral/Integral-tmp/build/CMakeFiles /tmp/tmp462flm0t/Integral/Integral-tmp/build//CMakeFiles/progress.marks
make -f CMakeFiles/Makefile2 all
make[2]: Entering directory '/tmp/tmp462flm0t/Integral/Integral-tmp/build'
make -f preprocess/CMakeFiles/preprocess.dir/build.make preprocess/CMakeFiles/preprocess.dir/depend
make[3]: Entering directory '/tmp/tmp462flm0t/Integral/Integral-tmp/build'
cd /tmp/tmp462flm0t/Integral/Integral-tmp/build && /usr/bin/cmake -E cmake_depends "Unix Makefiles" /tmp/tmp462flm0t/Integral/Integral-tmp /tmp/tmp462flm0t/Integral/Integral-tmp/preprocess /tmp/tmp462flm0t/Integral/Integral-tmp/build /tmp/tmp462flm0t/Integral/Integral-tmp/build/preprocess /tmp/tmp462flm0t/Integral/Integral-tmp/build/preprocess/CMakeFiles/preprocess.dir/DependInfo.cmake "--color="
make[3]: Leaving directory '/tmp/tmp462flm0t/Integral/Integral-tmp/build'
make -f preprocess/CMakeFiles/preprocess.dir/build.make preprocess/CMakeFiles/preprocess.dir/build
make[3]: Entering directory '/tmp/tmp462flm0t/Integral/Integral-tmp/build'
[ 3%] Building CXX object preprocess/CMakeFiles/preprocess.dir/net_processing.cc.o
cd /tmp/tmp462flm0t/Integral/Integral-tmp/build/preprocess && /usr/bin/g++ -DFMT_HEADER_ONLY -I/tmp/tmp462flm0t/Integral/Integral-tmp/preprocess/../third-party/fathom -I/tmp/tmp462flm0t/Integral/Integral-tmp/preprocess/../third-party/fmt/include -march=native -DBUILD_NATIVE -O3 -DNDEBUG -std=gnu++20 -MD -MT preprocess/CMakeFiles/preprocess.dir/net_processing.cc.o -MF CMakeFiles/preprocess.dir/net_processing.cc.o.d -o CMakeFiles/preprocess.dir/net_processing.cc.o -c /tmp/tmp462flm0t/Integral/Integral-tmp/preprocess/net_processing.cc
/tmp/tmp462flm0t/Integral/Integral-tmp/preprocess/net_processing.cc: In function ‘std::unique_ptr<nnue::ValueNetwork> ProcessNetwork(const std::unique_ptr<nnue::RawValueNetwork>&)’:
/tmp/tmp462flm0t/Integral/Integral-tmp/preprocess/net_processing.cc:22:31: warning: ignoring attributes on template argument ‘__m128i’ [-Wignored-attributes]
22 | std::array<__m128i, kNumRegs> regs;
| ^
[ 6%] Linking CXX executable preprocess
cd /tmp/tmp462flm0t/Integral/Integral-tmp/build/preprocess && /usr/bin/cmake -E cmake_link_script CMakeFiles/preprocess.dir/link.txt --verbose=1
/usr/bin/g++ -march=native -DBUILD_NATIVE -O3 -DNDEBUG CMakeFiles/preprocess.dir/net_processing.cc.o -o preprocess
make[3]: Leaving directory '/tmp/tmp462flm0t/Integral/Integral-tmp/build'
[ 6%] Built target preprocess
make -f CMakeFiles/run_preprocess.dir/build.make CMakeFiles/run_preprocess.dir/depend
make[3]: Entering directory '/tmp/tmp462flm0t/Integral/Integral-tmp/build'
cd /tmp/tmp462flm0t/Integral/Integral-tmp/build && /usr/bin/cmake -E cmake_depends "Unix Makefiles" /tmp/tmp462flm0t/Integral/Integral-tmp /tmp/tmp462flm0t/Integral/Integral-tmp /tmp/tmp462flm0t/Integral/Integral-tmp/build /tmp/tmp462flm0t/Integral/Integral-tmp/build /tmp/tmp462flm0t/Integral/Integral-tmp/build/CMakeFiles/run_preprocess.dir/DependInfo.cmake "--color="
make[3]: Leaving directory '/tmp/tmp462flm0t/Integral/Integral-tmp/build'
make -f CMakeFiles/run_preprocess.dir/build.make CMakeFiles/run_preprocess.dir/build
make[3]: Entering directory '/tmp/tmp462flm0t/Integral/Integral-tmp/build'
[ 9%] Running net preprocessing
preprocess/preprocess /workspace/OpenBench/Client/Networks/F586B7C9 /tmp/tmp462flm0t/Integral/Integral-tmp/build/processed.nnue
Preprocessing /workspace/OpenBench/Client/Networks/F586B7C9
Successfully wrote processed network to /tmp/tmp462flm0t/Integral/Integral-tmp/build/processed.nnue
make[3]: Leaving directory '/tmp/tmp462flm0t/Integral/Integral-tmp/build'
[ 9%] Built target run_preprocess
make -f CMakeFiles/integral.dir/build.make CMakeFiles/integral.dir/depend
make[3]: Entering directory '/tmp/tmp462flm0t/Integral/Integral-tmp/build'
cd /tmp/tmp462flm0t/Integral/Integral-tmp/build && /usr/bin/cmake -E cmake_depends "Unix Makefiles" /tmp/tmp462flm0t/Integral/Integral-tmp /tmp/tmp462flm0t/Integral/Integral-tmp /tmp/tmp462flm0t/Integral/Integral-tmp/build /tmp/tmp462flm0t/Integral/Integral-tmp/build /tmp/tmp462flm0t/Integral/Integral-tmp/build/CMakeFiles/integral.dir/DependInfo.cmake "--color="
make[3]: Leaving directory '/tmp/tmp462flm0t/Integral/Integral-tmp/build'
make -f CMakeFiles/integral.dir/build.make CMakeFiles/integral.dir/build
make[3]: Entering directory '/tmp/tmp462flm0t/Integral/Integral-tmp/build'
[ 12%] Building CXX object CMakeFiles/integral.dir/src/chess/board.cc.o
[ 15%] Building CXX object CMakeFiles/integral.dir/src/chess/move.cc.o
/usr/bin/g++ -DEVALFILE=\"/tmp/tmp462flm0t/Integral/Integral-tmp/build/processed.nnue\" -DFMT_HEADER_ONLY -DPOLICYFILE=\"/tmp/tmp462flm0t/Integral/Integral-tmp/policy.pn\" -I/tmp/tmp462flm0t/Integral/Integral-tmp/third-party/fathom -I/tmp/tmp462flm0t/Integral/Integral-tmp/third-party/fmt/include -march=native -DBUILD_NATIVE -DUSE_PEXT -pthread -O3 -funroll-loops -DNDEBUG -std=gnu++20 -flto=auto -fno-fat-lto-objects -fprofile-generate -MD -MT CMakeFiles/integral.dir/src/chess/board.cc.o -MF CMakeFiles/integral.dir/src/chess/board.cc.o.d -o CMakeFiles/integral.dir/src/chess/board.cc.o -c /tmp/tmp462flm0t/Integral/Integral-tmp/src/chess/board.cc
[ 18%] Building CXX object CMakeFiles/integral.dir/src/chess/fen.cc.o
[ 21%] Building CXX object CMakeFiles/integral.dir/src/chess/move_gen.cc.o
/usr/bin/g++ -DEVALFILE=\"/tmp/tmp462flm0t/Integral/Integral-tmp/build/processed.nnue\" -DFMT_HEADER_ONLY -DPOLICYFILE=\"/tmp/tmp462flm0t/Integral/Integral-tmp/policy.pn\" -I/tmp/tmp462flm0t/Integral/Integral-tmp/third-party/fathom -I/tmp/tmp462flm0t/Integral/Integral-tmp/third-party/fmt/include -march=native -DBUILD_NATIVE -DUSE_PEXT -pthread -O3 -funroll-loops -DNDEBUG -std=gnu++20 -flto=auto -fno-fat-lto-objects -fprofile-generate -MD -MT CMakeFiles/integral.dir/src/chess/move.cc.o -MF CMakeFiles/integral.dir/src/chess/move.cc.o.d -o CMakeFiles/integral.dir/src/chess/move.cc.o -c /tmp/tmp462flm0t/Integral/Integral-tmp/src/chess/move.cc
[ 24%] Building CXX object CMakeFiles/integral.dir/src/engine/evaluation/evaluation.cc.o
/usr/bin/g++ -DEVALFILE=\"/tmp/tmp462flm0t/Integral/Integral-tmp/build/processed.nnue\" -DFMT_HEADER_ONLY -DPOLICYFILE=\"/tmp/tmp462flm0t/Integral/Integral-tmp/policy.pn\" -I/tmp/tmp462flm0t/Integral/Integral-tmp/third-party/fathom -I/tmp/tmp462flm0t/Integral/Integral-tmp/third-party/fmt/include -march=native -DBUILD_NATIVE -DUSE_PEXT -pthread -O3 -funroll-loops -DNDEBUG -std=gnu++20 -flto=auto -fno-fat-lto-objects -fprofile-generate -MD -MT CMakeFiles/integral.dir/src/chess/fen.cc.o -MF CMakeFiles/integral.dir/src/chess/fen.cc.o.d -o CMakeFiles/integral.dir/src/chess/fen.cc.o -c /tmp/tmp462flm0t/Integral/Integral-tmp/src/chess/fen.cc
[ 36%] Building CXX object CMakeFiles/integral.dir/src/engine/evaluation/nnue/pawn_pair/pawn_pair_features.cc.o
[ 36%] Building CXX object CMakeFiles/integral.dir/src/engine/evaluation/nnue/policy/policy.cc.o
[ 36%] Building CXX object CMakeFiles/integral.dir/src/engine/evaluation/nnue/policy/policy_accumulator.cc.o
[ 36%] Building CXX object CMakeFiles/integral.dir/src/engine/evaluation/nnue/accumulator.cc.o
/usr/bin/g++ -DEVALFILE=\"/tmp/tmp462flm0t/Integral/Integral-tmp/build/processed.nnue\" -DFMT_HEADER_ONLY -DPOLICYFILE=\"/tmp/tmp462flm0t/Integral/Integral-tmp/policy.pn\" -I/tmp/tmp462flm0t/Integral/Integral-tmp/third-party/fathom -I/tmp/tmp462flm0t/Integral/Integral-tmp/third-party/fmt/include -march=native -DBUILD_NATIVE -DUSE_PEXT -pthread -O3 -funroll-loops -DNDEBUG -std=gnu++20 -flto=auto -fno-fat-lto-objects -fprofile-generate -MD -MT CMakeFiles/integral.dir/src/chess/move_gen.cc.o -MF CMakeFiles/integral.dir/src/chess/move_gen.cc.o.d -o CMakeFiles/integral.dir/src/chess/move_gen.cc.o -c /tmp/tmp462flm0t/Integral/Integral-tmp/src/chess/move_gen.cc
[ 39%] Building CXX object CMakeFiles/integral.dir/src/engine/evaluation/nnue/nnue.cc.o
[ 45%] Building CXX object CMakeFiles/integral.dir/src/engine/evaluation/nnue/psqt_accumulator.cc.o
[ 45%] Building CXX object CMakeFiles/integral.dir/src/data_gen/data_gen.cc.o
/usr/bin/g++ -DEVALFILE=\"/tmp/tmp462flm0t/Integral/Integral-tmp/build/processed.nnue\" -DFMT_HEADER_ONLY -DPOLICYFILE=\"/tmp/tmp462flm0t/Integral/Integral-tmp/policy.pn\" -I/tmp/tmp462flm0t/Integral/Integral-tmp/third-party/fathom -I/tmp/tmp462flm0t/Integral/Integral-tmp/third-party/fmt/include -march=native -DBUILD_NATIVE -DUSE_PEXT -pthread -O3 -funroll-loops -DNDEBUG -std=gnu++20 -flto=auto -fno-fat-lto-objects -fprofile-generate -MD -MT CMakeFiles/integral.dir/src/engine/evaluation/evaluation.cc.o -MF CMakeFiles/integral.dir/src/engine/evaluation/evaluation.cc.o.d -o CMakeFiles/integral.dir/src/engine/evaluation/evaluation.cc.o -c /tmp/tmp462flm0t/Integral/Integral-tmp/src/engine/evaluation/evaluation.cc
[ 48%] Building CXX object CMakeFiles/integral.dir/src/engine/evaluation/nnue/threat_accumulator.cc.o
[ 51%] Building CXX object CMakeFiles/integral.dir/src/engine/evaluation/nnue/threats/threat_features.cc.o
/usr/bin/g++ -DEVALFILE=\"/tmp/tmp462flm0t/Integral/Integral-tmp/build/processed.nnue\" -DFMT_HEADER_ONLY -DPOLICYFILE=\"/tmp/tmp462flm0t/Integral/Integral-tmp/policy.pn\" -I/tmp/tmp462flm0t/Integral/Integral-tmp/third-party/fathom -I/tmp/tmp462flm0t/Integral/Integral-tmp/third-party/fmt/include -march=native -DBUILD_NATIVE -DUSE_PEXT -pthread -O3 -funroll-loops -DNDEBUG -std=gnu++20 -flto=auto -fno-fat-lto-objects -fprofile-generate -MD -MT CMakeFiles/integral.dir/src/engine/evaluation/nnue/accumulator.cc.o -MF CMakeFiles/integral.dir/src/engine/evaluation/nnue/accumulator.cc.o.d -o CMakeFiles/integral.dir/src/engine/evaluation/nnue/accumulator.cc.o -c /tmp/tmp462flm0t/Integral/Integral-tmp/src/engine/evaluation/nnue/accumulator.cc
[ 54%] Building CXX object CMakeFiles/integral.dir/src/engine/search/cuckoo.cc.o
/usr/bin/g++ -DEVALFILE=\"/tmp/tmp462flm0t/Integral/Integral-tmp/build/processed.nnue\" -DFMT_HEADER_ONLY -DPOLICYFILE=\"/tmp/tmp462flm0t/Integral/Integral-tmp/policy.pn\" -I/tmp/tmp462flm0t/Integral/Integral-tmp/third-party/fathom -I/tmp/tmp462flm0t/Integral/Integral-tmp/third-party/fmt/include -march=native -DBUILD_NATIVE -DUSE_PEXT -pthread -O3 -funroll-loops -DNDEBUG -std=gnu++20 -flto=auto -fno-fat-lto-objects -fprofile-generate -MD -MT CMakeFiles/integral.dir/src/engine/evaluation/nnue/nnue.cc.o -MF CMakeFiles/integral.dir/src/engine/evaluation/nnue/nnue.cc.o.d -o CMakeFiles/integral.dir/src/engine/evaluation/nnue/nnue.cc.o -c /tmp/tmp462flm0t/Integral/Integral-tmp/src/engine/evaluation/nnue/nnue.cc
[ 57%] Building CXX object CMakeFiles/integral.dir/src/engine/search/move_picker.cc.o
/usr/bin/g++ -DEVALFILE=\"/tmp/tmp462flm0t/Integral/Integral-tmp/build/processed.nnue\" -DFMT_HEADER_ONLY -DPOLICYFILE=\"/tmp/tmp462flm0t/Integral/Integral-tmp/policy.pn\" -I/tmp/tmp462flm0t/Integral/Integral-tmp/third-party/fathom -I/tmp/tmp462flm0t/Integral/Integral-tmp/third-party/fmt/include -march=native -DBUILD_NATIVE -DUSE_PEXT -pthread -O3 -funroll-loops -DNDEBUG -std=gnu++20 -flto=auto -fno-fat-lto-objects -fprofile-generate -MD -MT CMakeFiles/integral.dir/src/engine/evaluation/nnue/pawn_pair/pawn_pair_features.cc.o -MF CMakeFiles/integral.dir/src/engine/evaluation/nnue/pawn_pair/pawn_pair_features.cc.o.d -o CMakeFiles/integral.dir/src/engine/evaluation/nnue/pawn_pair/pawn_pair_features.cc.o -c /tmp/tmp462flm0t/Integral/Integral-tmp/src/engine/evaluation/nnue/pawn_pair/pawn_pair_features.cc
[ 60%] Building CXX object CMakeFiles/integral.dir/src/engine/search/search.cc.o
/usr/bin/g++ -DEVALFILE=\"/tmp/tmp462flm0t/Integral/Integral-tmp/build/processed.nnue\" -DFMT_HEADER_ONLY -DPOLICYFILE=\"/tmp/tmp462flm0t/Integral/Integral-tmp/policy.pn\" -I/tmp/tmp462flm0t/Integral/Integral-tmp/third-party/fathom -I/tmp/tmp462flm0t/Integral/Integral-tmp/third-party/fmt/include -march=native -DBUILD_NATIVE -DUSE_PEXT -pthread -O3 -funroll-loops -DNDEBUG -std=gnu++20 -flto=auto -fno-fat-lto-objects -fprofile-generate -MD -MT CMakeFiles/integral.dir/src/data_gen/data_gen.cc.o -MF CMakeFiles/integral.dir/src/data_gen/data_gen.cc.o.d -o CMakeFiles/integral.dir/src/data_gen/data_gen.cc.o -c /tmp/tmp462flm0t/Integral/Integral-tmp/src/data_gen/data_gen.cc
/usr/bin/g++ -DEVALFILE=\"/tmp/tmp462flm0t/Integral/Integral-tmp/build/processed.nnue\" -DFMT_HEADER_ONLY -DPOLICYFILE=\"/tmp/tmp462flm0t/Integral/Integral-tmp/policy.pn\" -I/tmp/tmp462flm0t/Integral/Integral-tmp/third-party/fathom -I/tmp/tmp462flm0t/Integral/Integral-tmp/third-party/fmt/include -march=native -DBUILD_NATIVE -DUSE_PEXT -pthread -O3 -funroll-loops -DNDEBUG -std=gnu++20 -flto=auto -fno-fat-lto-objects -fprofile-generate -MD -MT CMakeFiles/integral.dir/src/engine/evaluation/nnue/policy/policy.cc.o -MF CMakeFiles/integral.dir/src/engine/evaluation/nnue/policy/policy.cc.o.d -o CMakeFiles/integral.dir/src/engine/evaluation/nnue/policy/policy.cc.o -c /tmp/tmp462flm0t/Integral/Integral-tmp/src/engine/evaluation/nnue/policy/policy.cc
[ 63%] Building CXX object CMakeFiles/integral.dir/src/engine/search/syzygy/syzygy.cc.o
/usr/bin/g++ -DEVALFILE=\"/tmp/tmp462flm0t/Integral/Integral-tmp/build/processed.nnue\" -DFMT_HEADER_ONLY -DPOLICYFILE=\"/tmp/tmp462flm0t/Integral/Integral-tmp/policy.pn\" -I/tmp/tmp462flm0t/Integral/Integral-tmp/third-party/fathom -I/tmp/tmp462flm0t/Integral/Integral-tmp/third-party/fmt/include -march=native -DBUILD_NATIVE -DUSE_PEXT -pthread -O3 -funroll-loops -DNDEBUG -std=gnu++20 -flto=auto -fno-fat-lto-objects -fprofile-generate -MD -MT CMakeFiles/integral.dir/src/engine/evaluation/nnue/policy/policy_accumulator.cc.o -MF CMakeFiles/integral.dir/src/engine/evaluation/nnue/policy/policy_accumulator.cc.o.d -o CMakeFiles/integral.dir/src/engine/evaluation/nnue/policy/policy_accumulator.cc.o -c /tmp/tmp462flm0t/Integral/Integral-tmp/src/engine/evaluation/nnue/policy/policy_accumulator.cc
[ 66%] Building CXX object CMakeFiles/integral.dir/src/engine/search/time_mgmt.cc.o
[ 69%] Building CXX object CMakeFiles/integral.dir/src/engine/search/transpo.cc.o
/usr/bin/g++ -DEVALFILE=\"/tmp/tmp462flm0t/Integral/Integral-tmp/build/processed.nnue\" -DFMT_HEADER_ONLY -DPOLICYFILE=\"/tmp/tmp462flm0t/Integral/Integral-tmp/policy.pn\" -I/tmp/tmp462flm0t/Integral/Integral-tmp/third-party/fathom -I/tmp/tmp462flm0t/Integral/Integral-tmp/third-party/fmt/include -march=native -DBUILD_NATIVE -DUSE_PEXT -pthread -O3 -funroll-loops -DNDEBUG -std=gnu++20 -flto=auto -fno-fat-lto-objects -fprofile-generate -MD -MT CMakeFiles/integral.dir/src/engine/evaluation/nnue/psqt_accumulator.cc.o -MF CMakeFiles/integral.dir/src/engine/evaluation/nnue/psqt_accumulator.cc.o.d -o CMakeFiles/integral.dir/src/engine/evaluation/nnue/psqt_accumulator.cc.o -c /tmp/tmp462flm0t/Integral/Integral-tmp/src/engine/evaluation/nnue/psqt_accumulator.cc
[ 72%] Building CXX object CMakeFiles/integral.dir/src/engine/uci/uci.cc.o
/usr/bin/g++ -DEVALFILE=\"/tmp/tmp462flm0t/Integral/Integral-tmp/build/processed.nnue\" -DFMT_HEADER_ONLY -DPOLICYFILE=\"/tmp/tmp462flm0t/Integral/Integral-tmp/policy.pn\" -I/tmp/tmp462flm0t/Integral/Integral-tmp/third-party/fathom -I/tmp/tmp462flm0t/Integral/Integral-tmp/third-party/fmt/include -march=native -DBUILD_NATIVE -DUSE_PEXT -pthread -O3 -funroll-loops -DNDEBUG -std=gnu++20 -flto=auto -fno-fat-lto-objects -fprofile-generate -MD -MT CMakeFiles/integral.dir/src/engine/evaluation/nnue/threat_accumulator.cc.o -MF CMakeFiles/integral.dir/src/engine/evaluation/nnue/threat_accumulator.cc.o.d -o CMakeFiles/integral.dir/src/engine/evaluation/nnue/threat_accumulator.cc.o -c /tmp/tmp462flm0t/Integral/Integral-tmp/src/engine/evaluation/nnue/threat_accumulator.cc
/usr/bin/g++ -DEVALFILE=\"/tmp/tmp462flm0t/Integral/Integral-tmp/build/processed.nnue\" -DFMT_HEADER_ONLY -DPOLICYFILE=\"/tmp/tmp462flm0t/Integral/Integral-tmp/policy.pn\" -I/tmp/tmp462flm0t/Integral/Integral-tmp/third-party/fathom -I/tmp/tmp462flm0t/Integral/Integral-tmp/third-party/fmt/include -march=native -DBUILD_NATIVE -DUSE_PEXT -pthread -O3 -funroll-loops -DNDEBUG -std=gnu++20 -flto=auto -fno-fat-lto-objects -fprofile-generate -MD -MT CMakeFiles/integral.dir/src/engine/evaluation/nnue/threats/threat_features.cc.o -MF CMakeFiles/integral.dir/src/engine/evaluation/nnue/threats/threat_features.cc.o.d -o CMakeFiles/integral.dir/src/engine/evaluation/nnue/threats/threat_features.cc.o -c /tmp/tmp462flm0t/Integral/Integral-tmp/src/engine/evaluation/nnue/threats/threat_features.cc
[ 75%] Building CXX object CMakeFiles/integral.dir/src/magics/attacks.cc.o
/usr/bin/g++ -DEVALFILE=\"/tmp/tmp462flm0t/Integral/Integral-tmp/build/processed.nnue\" -DFMT_HEADER_ONLY -DPOLICYFILE=\"/tmp/tmp462flm0t/Integral/Integral-tmp/policy.pn\" -I/tmp/tmp462flm0t/Integral/Integral-tmp/third-party/fathom -I/tmp/tmp462flm0t/Integral/Integral-tmp/third-party/fmt/include -march=native -DBUILD_NATIVE -DUSE_PEXT -pthread -O3 -funroll-loops -DNDEBUG -std=gnu++20 -flto=auto -fno-fat-lto-objects -fprofile-generate -MD -MT CMakeFiles/integral.dir/src/engine/search/cuckoo.cc.o -MF CMakeFiles/integral.dir/src/engine/search/cuckoo.cc.o.d -o CMakeFiles/integral.dir/src/engine/search/cuckoo.cc.o -c /tmp/tmp462flm0t/Integral/Integral-tmp/src/engine/search/cuckoo.cc
/usr/bin/g++ -DEVALFILE=\"/tmp/tmp462flm0t/Integral/Integral-tmp/build/processed.nnue\" -DFMT_HEADER_ONLY -DPOLICYFILE=\"/tmp/tmp462flm0t/Integral/Integral-tmp/policy.pn\" -I/tmp/tmp462flm0t/Integral/Integral-tmp/third-party/fathom -I/tmp/tmp462flm0t/Integral/Integral-tmp/third-party/fmt/include -march=native -DBUILD_NATIVE -DUSE_PEXT -pthread -O3 -funroll-loops -DNDEBUG -std=gnu++20 -flto=auto -fno-fat-lto-objects -fprofile-generate -MD -MT CMakeFiles/integral.dir/src/engine/search/move_picker.cc.o -MF CMakeFiles/integral.dir/src/engine/search/move_picker.cc.o.d -o CMakeFiles/integral.dir/src/engine/search/move_picker.cc.o -c /tmp/tmp462flm0t/Integral/Integral-tmp/src/engine/search/move_picker.cc
[ 78%] Building CXX object CMakeFiles/integral.dir/src/magics/magic_finder.cc.o
/usr/bin/g++ -DEVALFILE=\"/tmp/tmp462flm0t/Integral/Integral-tmp/build/processed.nnue\" -DFMT_HEADER_ONLY -DPOLICYFILE=\"/tmp/tmp462flm0t/Integral/Integral-tmp/policy.pn\" -I/tmp/tmp462flm0t/Integral/Integral-tmp/third-party/fathom -I/tmp/tmp462flm0t/Integral/Integral-tmp/third-party/fmt/include -march=native -DBUILD_NATIVE -DUSE_PEXT -pthread -O3 -funroll-loops -DNDEBUG -std=gnu++20 -flto=auto -fno-fat-lto-objects -fprofile-generate -MD -MT CMakeFiles/integral.dir/src/engine/search/search.cc.o -MF CMakeFiles/integral.dir/src/engine/search/search.cc.o.d -o CMakeFiles/integral.dir/src/engine/search/search.cc.o -c /tmp/tmp462flm0t/Integral/Integral-tmp/src/engine/search/search.cc
/usr/bin/g++ -DEVALFILE=\"/tmp/tmp462flm0t/Integral/Integral-tmp/build/processed.nnue\" -DFMT_HEADER_ONLY -DPOLICYFILE=\"/tmp/tmp462flm0t/Integral/Integral-tmp/policy.pn\" -I/tmp/tmp462flm0t/Integral/Integral-tmp/third-party/fathom -I/tmp/tmp462flm0t/Integral/Integral-tmp/third-party/fmt/include -march=native -DBUILD_NATIVE -DUSE_PEXT -pthread -O3 -funroll-loops -DNDEBUG -std=gnu++20 -flto=auto -fno-fat-lto-objects -fprofile-generate -MD -MT CMakeFiles/integral.dir/src/engine/search/syzygy/syzygy.cc.o -MF CMakeFiles/integral.dir/src/engine/search/syzygy/syzygy.cc.o.d -o CMakeFiles/integral.dir/src/engine/search/syzygy/syzygy.cc.o -c /tmp/tmp462flm0t/Integral/Integral-tmp/src/engine/search/syzygy/syzygy.cc
[ 81%] Building CXX object CMakeFiles/integral.dir/src/main.cc.o
/usr/bin/g++ -DEVALFILE=\"/tmp/tmp462flm0t/Integral/Integral-tmp/build/processed.nnue\" -DFMT_HEADER_ONLY -DPOLICYFILE=\"/tmp/tmp462flm0t/Integral/Integral-tmp/policy.pn\" -I/tmp/tmp462flm0t/Integral/Integral-tmp/third-party/fathom -I/tmp/tmp462flm0t/Integral/Integral-tmp/third-party/fmt/include -march=native -DBUILD_NATIVE -DUSE_PEXT -pthread -O3 -funroll-loops -DNDEBUG -std=gnu++20 -flto=auto -fno-fat-lto-objects -fprofile-generate -MD -MT CMakeFiles/integral.dir/src/engine/search/time_mgmt.cc.o -MF CMakeFiles/integral.dir/src/engine/search/time_mgmt.cc.o.d -o CMakeFiles/integral.dir/src/engine/search/time_mgmt.cc.o -c /tmp/tmp462flm0t/Integral/Integral-tmp/src/engine/search/time_mgmt.cc
[ 87%] Building CXX object CMakeFiles/integral.dir/src/tests/perft_test.cc.o
[ 87%] Building CXX object CMakeFiles/integral.dir/src/tests/bench_test.cc.o
/usr/bin/g++ -DEVALFILE=\"/tmp/tmp462flm0t/Integral/Integral-tmp/build/processed.nnue\" -DFMT_HEADER_ONLY -DPOLICYFILE=\"/tmp/tmp462flm0t/Integral/Integral-tmp/policy.pn\" -I/tmp/tmp462flm0t/Integral/Integral-tmp/third-party/fathom -I/tmp/tmp462flm0t/Integral/Integral-tmp/third-party/fmt/include -march=native -DBUILD_NATIVE -DUSE_PEXT -pthread -O3 -funroll-loops -DNDEBUG -std=gnu++20 -flto=auto -fno-fat-lto-objects -fprofile-generate -MD -MT CMakeFiles/integral.dir/src/engine/search/transpo.cc.o -MF CMakeFiles/integral.dir/src/engine/search/transpo.cc.o.d -o CMakeFiles/integral.dir/src/engine/search/transpo.cc.o -c /tmp/tmp462flm0t/Integral/Integral-tmp/src/engine/search/transpo.cc
/usr/bin/g++ -DEVALFILE=\"/tmp/tmp462flm0t/Integral/Integral-tmp/build/processed.nnue\" -DFMT_HEADER_ONLY -DPOLICYFILE=\"/tmp/tmp462flm0t/Integral/Integral-tmp/policy.pn\" -I/tmp/tmp462flm0t/Integral/Integral-tmp/third-party/fathom -I/tmp/tmp462flm0t/Integral/Integral-tmp/third-party/fmt/include -march=native -DBUILD_NATIVE -DUSE_PEXT -pthread -O3 -funroll-loops -DNDEBUG -std=gnu++20 -flto=auto -fno-fat-lto-objects -fprofile-generate -MD -MT CMakeFiles/integral.dir/src/engine/uci/uci.cc.o -MF CMakeFiles/integral.dir/src/engine/uci/uci.cc.o.d -o CMakeFiles/integral.dir/src/engine/uci/uci.cc.o -c /tmp/tmp462flm0t/Integral/Integral-tmp/src/engine/uci/uci.cc
[ 90%] Building CXX object CMakeFiles/integral.dir/src/tests/see_test.cc.o
/usr/bin/g++ -DEVALFILE=\"/tmp/tmp462flm0t/Integral/Integral-tmp/build/processed.nnue\" -DFMT_HEADER_ONLY -DPOLICYFILE=\"/tmp/tmp462flm0t/Integral/Integral-tmp/policy.pn\" -I/tmp/tmp462flm0t/Integral/Integral-tmp/third-party/fathom -I/tmp/tmp462flm0t/Integral/Integral-tmp/third-party/fmt/include -march=native -DBUILD_NATIVE -DUSE_PEXT -pthread -O3 -funroll-loops -DNDEBUG -std=gnu++20 -flto=auto -fno-fat-lto-objects -fprofile-generate -MD -MT CMakeFiles/integral.dir/src/magics/attacks.cc.o -MF CMakeFiles/integral.dir/src/magics/attacks.cc.o.d -o CMakeFiles/integral.dir/src/magics/attacks.cc.o -c /tmp/tmp462flm0t/Integral/Integral-tmp/src/magics/attacks.cc
/usr/bin/g++ -DEVALFILE=\"/tmp/tmp462flm0t/Integral/Integral-tmp/build/processed.nnue\" -DFMT_HEADER_ONLY -DPOLICYFILE=\"/tmp/tmp462flm0t/Integral/Integral-tmp/policy.pn\" -I/tmp/tmp462flm0t/Integral/Integral-tmp/third-party/fathom -I/tmp/tmp462flm0t/Integral/Integral-tmp/third-party/fmt/include -march=native -DBUILD_NATIVE -DUSE_PEXT -pthread -O3 -funroll-loops -DNDEBUG -std=gnu++20 -flto=auto -fno-fat-lto-objects -fprofile-generate -MD -MT CMakeFiles/integral.dir/src/magics/magic_finder.cc.o -MF CMakeFiles/integral.dir/src/magics/magic_finder.cc.o.d -o CMakeFiles/integral.dir/src/magics/magic_finder.cc.o -c /tmp/tmp462flm0t/Integral/Integral-tmp/src/magics/magic_finder.cc
/usr/bin/g++ -DEVALFILE=\"/tmp/tmp462flm0t/Integral/Integral-tmp/build/processed.nnue\" -DFMT_HEADER_ONLY -DPOLICYFILE=\"/tmp/tmp462flm0t/Integral/Integral-tmp/policy.pn\" -I/tmp/tmp462flm0t/Integral/Integral-tmp/third-party/fathom -I/tmp/tmp462flm0t/Integral/Integral-tmp/third-party/fmt/include -march=native -DBUILD_NATIVE -DUSE_PEXT -pthread -O3 -funroll-loops -DNDEBUG -std=gnu++20 -flto=auto -fno-fat-lto-objects -fprofile-generate -MD -MT CMakeFiles/integral.dir/src/main.cc.o -MF CMakeFiles/integral.dir/src/main.cc.o.d -o CMakeFiles/integral.dir/src/main.cc.o -c /tmp/tmp462flm0t/Integral/Integral-tmp/src/main.cc
[ 93%] Building C object CMakeFiles/integral.dir/third-party/fathom/tbprobe.c.o
/usr/bin/g++ -DEVALFILE=\"/tmp/tmp462flm0t/Integral/Integral-tmp/build/processed.nnue\" -DFMT_HEADER_ONLY -DPOLICYFILE=\"/tmp/tmp462flm0t/Integral/Integral-tmp/policy.pn\" -I/tmp/tmp462flm0t/Integral/Integral-tmp/third-party/fathom -I/tmp/tmp462flm0t/Integral/Integral-tmp/third-party/fmt/include -march=native -DBUILD_NATIVE -DUSE_PEXT -pthread -O3 -funroll-loops -DNDEBUG -std=gnu++20 -flto=auto -fno-fat-lto-objects -fprofile-generate -MD -MT CMakeFiles/integral.dir/src/tests/bench_test.cc.o -MF CMakeFiles/integral.dir/src/tests/bench_test.cc.o.d -o CMakeFiles/integral.dir/src/tests/bench_test.cc.o -c /tmp/tmp462flm0t/Integral/Integral-tmp/src/tests/bench_test.cc
/usr/bin/g++ -DEVALFILE=\"/tmp/tmp462flm0t/Integral/Integral-tmp/build/processed.nnue\" -DFMT_HEADER_ONLY -DPOLICYFILE=\"/tmp/tmp462flm0t/Integral/Integral-tmp/policy.pn\" -I/tmp/tmp462flm0t/Integral/Integral-tmp/third-party/fathom -I/tmp/tmp462flm0t/Integral/Integral-tmp/third-party/fmt/include -march=native -DBUILD_NATIVE -DUSE_PEXT -pthread -O3 -funroll-loops -DNDEBUG -std=gnu++20 -flto=auto -fno-fat-lto-objects -fprofile-generate -MD -MT CMakeFiles/integral.dir/src/tests/perft_test.cc.o -MF CMakeFiles/integral.dir/src/tests/perft_test.cc.o.d -o CMakeFiles/integral.dir/src/tests/perft_test.cc.o -c /tmp/tmp462flm0t/Integral/Integral-tmp/src/tests/perft_test.cc
/usr/bin/g++ -DEVALFILE=\"/tmp/tmp462flm0t/Integral/Integral-tmp/build/processed.nnue\" -DFMT_HEADER_ONLY -DPOLICYFILE=\"/tmp/tmp462flm0t/Integral/Integral-tmp/policy.pn\" -I/tmp/tmp462flm0t/Integral/Integral-tmp/third-party/fathom -I/tmp/tmp462flm0t/Integral/Integral-tmp/third-party/fmt/include -march=native -DBUILD_NATIVE -DUSE_PEXT -pthread -O3 -funroll-loops -DNDEBUG -std=gnu++20 -flto=auto -fno-fat-lto-objects -fprofile-generate -MD -MT CMakeFiles/integral.dir/src/tests/see_test.cc.o -MF CMakeFiles/integral.dir/src/tests/see_test.cc.o.d -o CMakeFiles/integral.dir/src/tests/see_test.cc.o -c /tmp/tmp462flm0t/Integral/Integral-tmp/src/tests/see_test.cc
/usr/bin/gcc -DEVALFILE=\"/tmp/tmp462flm0t/Integral/Integral-tmp/build/processed.nnue\" -DFMT_HEADER_ONLY -DPOLICYFILE=\"/tmp/tmp462flm0t/Integral/Integral-tmp/policy.pn\" -I/tmp/tmp462flm0t/Integral/Integral-tmp/third-party/fathom -I/tmp/tmp462flm0t/Integral/Integral-tmp/third-party/fmt/include -O3 -DNDEBUG -flto=auto -fno-fat-lto-objects -fprofile-generate -MD -MT CMakeFiles/integral.dir/third-party/fathom/tbprobe.c.o -MF CMakeFiles/integral.dir/third-party/fathom/tbprobe.c.o.d -o CMakeFiles/integral.dir/third-party/fathom/tbprobe.c.o -c /tmp/tmp462flm0t/Integral/Integral-tmp/third-party/fathom/tbprobe.c
/tmp/tmp462flm0t/Integral/Integral-tmp/third-party/fathom/tbprobe.c:150: warning: "popcount" redefined
150 | #define popcount(x) tb_software_popcount(x)
|
/tmp/tmp462flm0t/Integral/Integral-tmp/third-party/fathom/tbprobe.c:130: note: this is the location of the previous definition
130 | #define popcount(x) __builtin_popcountll((x))
|
In file included from /tmp/tmp462flm0t/Integral/Integral-tmp/src/data_gen/data_gen.cc:12:
/tmp/tmp462flm0t/Integral/Integral-tmp/src/data_gen/format/binpack.h:69:15: warning: ignoring packed attribute because of unpacked non-POD field ‘data_gen::format::U4Array<32> data_gen::format::MarlinChessBoard::pieces’
69 | U4Array<32> pieces;
| ^~~~~~
[ 96%] Linking CXX executable integral
/usr/bin/cmake -E cmake_link_script CMakeFiles/integral.dir/link.txt --verbose=1
/usr/bin/g++ -march=native -DBUILD_NATIVE -DUSE_PEXT -pthread -O3 -funroll-loops -DNDEBUG -flto=auto -fno-fat-lto-objects -fprofile-generate CMakeFiles/integral.dir/src/chess/board.cc.o CMakeFiles/integral.dir/src/chess/fen.cc.o CMakeFiles/integral.dir/src/chess/move.cc.o CMakeFiles/integral.dir/src/chess/move_gen.cc.o CMakeFiles/integral.dir/src/data_gen/data_gen.cc.o CMakeFiles/integral.dir/src/engine/evaluation/evaluation.cc.o CMakeFiles/integral.dir/src/engine/evaluation/nnue/accumulator.cc.o CMakeFiles/integral.dir/src/engine/evaluation/nnue/nnue.cc.o CMakeFiles/integral.dir/src/engine/evaluation/nnue/pawn_pair/pawn_pair_features.cc.o CMakeFiles/integral.dir/src/engine/evaluation/nnue/policy/policy.cc.o CMakeFiles/integral.dir/src/engine/evaluation/nnue/policy/policy_accumulator.cc.o CMakeFiles/integral.dir/src/engine/evaluation/nnue/psqt_accumulator.cc.o CMakeFiles/integral.dir/src/engine/evaluation/nnue/threat_accumulator.cc.o CMakeFiles/integral.dir/src/engine/evaluation/nnue/threats/threat_features.cc.o CMakeFiles/integral.dir/src/engine/search/cuckoo.cc.o CMakeFiles/integral.dir/src/engine/search/move_picker.cc.o CMakeFiles/integral.dir/src/engine/search/search.cc.o CMakeFiles/integral.dir/src/engine/search/syzygy/syzygy.cc.o CMakeFiles/integral.dir/src/engine/search/time_mgmt.cc.o CMakeFiles/integral.dir/src/engine/search/transpo.cc.o CMakeFiles/integral.dir/src/engine/uci/uci.cc.o CMakeFiles/integral.dir/src/magics/attacks.cc.o CMakeFiles/integral.dir/src/magics/magic_finder.cc.o CMakeFiles/integral.dir/src/main.cc.o CMakeFiles/integral.dir/src/tests/bench_test.cc.o CMakeFiles/integral.dir/src/tests/perft_test.cc.o CMakeFiles/integral.dir/src/tests/see_test.cc.o "CMakeFiles/integral.dir/third-party/fathom/tbprobe.c.o" -o integral
make[3]: Leaving directory '/tmp/tmp462flm0t/Integral/Integral-tmp/build'
[100%] Built target integral
make[2]: Leaving directory '/tmp/tmp462flm0t/Integral/Integral-tmp/build'
/usr/bin/cmake -E cmake_progress_start /tmp/tmp462flm0t/Integral/Integral-tmp/build/CMakeFiles 0
make[1]: Leaving directory '/tmp/tmp462flm0t/Integral/Integral-tmp/build'
Generating PGO profile...
make[1]: Entering directory '/tmp/tmp462flm0t/Integral/Integral-tmp/build'
/usr/bin/cmake -P /tmp/tmp462flm0t/Integral/Integral-tmp/build/CMakeFiles/VerifyGlobs.cmake
/usr/bin/cmake -S/tmp/tmp462flm0t/Integral/Integral-tmp -B/tmp/tmp462flm0t/Integral/Integral-tmp/build --check-build-system CMakeFiles/Makefile.cmake 0
make -f CMakeFiles/Makefile2 pgo_profile
make[2]: Entering directory '/tmp/tmp462flm0t/Integral/Integral-tmp/build'
/usr/bin/cmake -P /tmp/tmp462flm0t/Integral/Integral-tmp/build/CMakeFiles/VerifyGlobs.cmake
/usr/bin/cmake -S/tmp/tmp462flm0t/Integral/Integral-tmp -B/tmp/tmp462flm0t/Integral/Integral-tmp/build --check-build-system CMakeFiles/Makefile.cmake 0
/usr/bin/cmake -E cmake_progress_start /tmp/tmp462flm0t/Integral/Integral-tmp/build/CMakeFiles 33
make -f CMakeFiles/Makefile2 CMakeFiles/pgo_profile.dir/all
make[3]: Entering directory '/tmp/tmp462flm0t/Integral/Integral-tmp/build'
make -f preprocess/CMakeFiles/preprocess.dir/build.make preprocess/CMakeFiles/preprocess.dir/depend
make[4]: Entering directory '/tmp/tmp462flm0t/Integral/Integral-tmp/build'
cd /tmp/tmp462flm0t/Integral/Integral-tmp/build && /usr/bin/cmake -E cmake_depends "Unix Makefiles" /tmp/tmp462flm0t/Integral/Integral-tmp /tmp/tmp462flm0t/Integral/Integral-tmp/preprocess /tmp/tmp462flm0t/Integral/Integral-tmp/build /tmp/tmp462flm0t/Integral/Integral-tmp/build/preprocess /tmp/tmp462flm0t/Integral/Integral-tmp/build/preprocess/CMakeFiles/preprocess.dir/DependInfo.cmake "--color="
make[4]: Leaving directory '/tmp/tmp462flm0t/Integral/Integral-tmp/build'
make -f preprocess/CMakeFiles/preprocess.dir/build.make preprocess/CMakeFiles/preprocess.dir/build
make[4]: Entering directory '/tmp/tmp462flm0t/Integral/Integral-tmp/build'
make[4]: Nothing to be done for 'preprocess/CMakeFiles/preprocess.dir/build'.
make[4]: Leaving directory '/tmp/tmp462flm0t/Integral/Integral-tmp/build'
[ 6%] Built target preprocess
make -f CMakeFiles/run_preprocess.dir/build.make CMakeFiles/run_preprocess.dir/depend
make[4]: Entering directory '/tmp/tmp462flm0t/Integral/Integral-tmp/build'
cd /tmp/tmp462flm0t/Integral/Integral-tmp/build && /usr/bin/cmake -E cmake_depends "Unix Makefiles" /tmp/tmp462flm0t/Integral/Integral-tmp /tmp/tmp462flm0t/Integral/Integral-tmp /tmp/tmp462flm0t/Integral/Integral-tmp/build /tmp/tmp462flm0t/Integral/Integral-tmp/build /tmp/tmp462flm0t/Integral/Integral-tmp/build/CMakeFiles/run_preprocess.dir/DependInfo.cmake "--color="
make[4]: Leaving directory '/tmp/tmp462flm0t/Integral/Integral-tmp/build'
make -f CMakeFiles/run_preprocess.dir/build.make CMakeFiles/run_preprocess.dir/build
make[4]: Entering directory '/tmp/tmp462flm0t/Integral/Integral-tmp/build'
make[4]: Nothing to be done for 'CMakeFiles/run_preprocess.dir/build'.
make[4]: Leaving directory '/tmp/tmp462flm0t/Integral/Integral-tmp/build'
[ 9%] Built target run_preprocess
make -f CMakeFiles/integral.dir/build.make CMakeFiles/integral.dir/depend
make[4]: Entering directory '/tmp/tmp462flm0t/Integral/Integral-tmp/build'
cd /tmp/tmp462flm0t/Integral/Integral-tmp/build && /usr/bin/cmake -E cmake_depends "Unix Makefiles" /tmp/tmp462flm0t/Integral/Integral-tmp /tmp/tmp462flm0t/Integral/Integral-tmp /tmp/tmp462flm0t/Integral/Integral-tmp/build /tmp/tmp462flm0t/Integral/Integral-tmp/build /tmp/tmp462flm0t/Integral/Integral-tmp/build/CMakeFiles/integral.dir/DependInfo.cmake "--color="
make[4]: Leaving directory '/tmp/tmp462flm0t/Integral/Integral-tmp/build'
make -f CMakeFiles/integral.dir/build.make CMakeFiles/integral.dir/build
make[4]: Entering directory '/tmp/tmp462flm0t/Integral/Integral-tmp/build'
make[4]: Nothing to be done for 'CMakeFiles/integral.dir/build'.
make[4]: Leaving directory '/tmp/tmp462flm0t/Integral/Integral-tmp/build'
[100%] Built target integral
make -f CMakeFiles/pgo_profile.dir/build.make CMakeFiles/pgo_profile.dir/depend
make[4]: Entering directory '/tmp/tmp462flm0t/Integral/Integral-tmp/build'
cd /tmp/tmp462flm0t/Integral/Integral-tmp/build && /usr/bin/cmake -E cmake_depends "Unix Makefiles" /tmp/tmp462flm0t/Integral/Integral-tmp /tmp/tmp462flm0t/Integral/Integral-tmp /tmp/tmp462flm0t/Integral/Integral-tmp/build /tmp/tmp462flm0t/Integral/Integral-tmp/build /tmp/tmp462flm0t/Integral/Integral-tmp/build/CMakeFiles/pgo_profile.dir/DependInfo.cmake "--color="
make[4]: Leaving directory '/tmp/tmp462flm0t/Integral/Integral-tmp/build'
make -f CMakeFiles/pgo_profile.dir/build.make CMakeFiles/pgo_profile.dir/build
make[4]: Entering directory '/tmp/tmp462flm0t/Integral/Integral-tmp/build'
/usr/bin/cmake -E remove_directory /tmp/tmp462flm0t/Integral/Integral-tmp/build/pgo
/usr/bin/cmake -E make_directory /tmp/tmp462flm0t/Integral/Integral-tmp/build/pgo
/usr/bin/cmake -E env LLVM_PROFILE_FILE=/tmp/tmp462flm0t/Integral/Integral-tmp/build/pgo/integral.profraw /tmp/tmp462flm0t/Integral/Integral-tmp/build/integral bench
make[4]: *** [CMakeFiles/pgo_profile.dir/build.make:75: CMakeFiles/pgo_profile] Interrupt
make[4]: Leaving directory '/tmp/tmp462flm0t/Integral/Integral-tmp/build'
make[3]: *** [CMakeFiles/Makefile2:159: CMakeFiles/pgo_profile.dir/all] Error 2
make[3]: Leaving directory '/tmp/tmp462flm0t/Integral/Integral-tmp/build'
make[2]: *** [CMakeFiles/Makefile2:166: CMakeFiles/pgo_profile.dir/rule] Error 2
make[2]: Leaving directory '/tmp/tmp462flm0t/Integral/Integral-tmp/build'
make[1]: *** [Makefile:154: pgo_profile] Error 2
make[1]: Leaving directory '/tmp/tmp462flm0t/Integral/Integral-tmp/build'
make: *** [Makefile:54: all] Error 2