fatal: not a git repository (or any of the parent directories): .git
mkdir -p ".tmp" ".tmp/Source" ".tmp/Source/nnue"
NNUE network 'net60.nnue' not found.
Downloading with curl...
  % Total    % Received % Xferd  Average Speed   Time    Time     Time  Current
                                 Dload  Upload   Total   Spent    Left  Speed

  0     0    0     0    0     0      0      0 --:--:-- --:--:-- --:--:--     0
  0     0    0     0    0     0      0      0 --:--:--  0:00:01 --:--:--     0
  0     0    0     0    0     0      0      0 --:--:--  0:00:01 --:--:--     0
  0     0    0     0    0     0      0      0 --:--:--  0:00:01 --:--:--     0

  0  224M    0  5503    0     0   2173      0 30:09:28  0:00:02 30:09:26  2173
  0  224M    0  426k    0     0   125k      0  0:30:32  0:00:03  0:30:29  489k
  3  224M    3 8925k    0     0  2078k      0  0:01:50  0:00:04  0:01:46 5059k
  9  224M    9 22.3M    0     0  4325k      0  0:00:53  0:00:05  0:00:48 8283k
 15  224M   15 35.9M    0     0  5849k      0  0:00:39  0:00:06  0:00:33 9776k
 23  224M   23 53.1M    0     0  7459k      0  0:00:30  0:00:07  0:00:23 11.1M
 31  224M   31 70.3M    0     0  8681k      0  0:00:26  0:00:08  0:00:18 14.2M
 38  224M   38 86.1M    0     0  9489k      0  0:00:24  0:00:09  0:00:15 15.4M
 46  224M   46  105M    0     0  10.2M      0  0:00:21  0:00:10  0:00:11 16.6M
 53  224M   53  119M    0     0  10.6M      0  0:00:21  0:00:11  0:00:10 16.7M
 57  224M   57  129M    0     0  10.5M      0  0:00:21  0:00:12  0:00:09 15.3M
 61  224M   61  137M    0     0  10.3M      0  0:00:21  0:00:13  0:00:08 13.5M
 65  224M   65  147M    0     0  10.3M      0  0:00:21  0:00:14  0:00:07 12.2M
 71  224M   71  160M    0     0  10.4M      0  0:00:21  0:00:15  0:00:06 10.9M
 76  224M   76  171M    0     0  10.5M      0  0:00:21  0:00:16  0:00:05 10.3M
 82  224M   82  186M    0     0  10.7M      0  0:00:20  0:00:17  0:00:03 11.3M
 86  224M   86  195M    0     0  10.6M      0  0:00:21  0:00:18  0:00:03 11.5M
 92  224M   92  208M    0     0  10.7M      0  0:00:20  0:00:19  0:00:01 12.0M
 99  224M   99  222M    0     0  10.9M      0  0:00:20  0:00:20 --:--:-- 12.5M
100  224M  100  224M    0     0  11.0M      0  0:00:20  0:00:20 --:--:-- 12.8M
Downloaded net60.nnue
fatal: not a git repository (or any of the parent directories): .git
gcc -g -std=gnu11 -funroll-loops -O3 -flto -fno-exceptions -DIS_64BIT -DNDEBUG -DGIT_HASH=\"\" -Wall -Werror -Wextra -Wno-error=vla -Wpedantic -Wno-unused-command-line-argument -DUSE_SIMD -DNETWORK_NAME=\"net60.nnue\" -DEVALFILE=\"processed.bin\" -o Tools/process_net Tools/process_net.c -pthread -lm
./Tools/process_net net60.nnue processed.bin
gcc -g -std=gnu11 -funroll-loops -O3 -flto -fno-exceptions -DIS_64BIT -DNDEBUG -Wall -Werror -Wextra -Wno-error=vla -Wpedantic -Wno-unused-command-line-argument -DGIT_HASH=\"\" -DUSE_AVX2 -DUSE_SIMD -mavx2 -mbmi -mbmi2 -DNETWORK_NAME=\"net60.nnue\" -DEVALFILE=\"processed.bin\" -march=native -MMD -MP -c Source/uci.c -o .tmp/Source/uci.o -pthread -lm
gcc -g -std=gnu11 -funroll-loops -O3 -flto -fno-exceptions -DIS_64BIT -DNDEBUG -Wall -Werror -Wextra -Wno-error=vla -Wpedantic -Wno-unused-command-line-argument -DGIT_HASH=\"\" -DUSE_AVX2 -DUSE_SIMD -mavx2 -mbmi -mbmi2 -DNETWORK_NAME=\"net60.nnue\" -DEVALFILE=\"processed.bin\" -march=native -MMD -MP -c Source/evaluate.c -o .tmp/Source/evaluate.o -pthread -lm
gcc -g -std=gnu11 -funroll-loops -O3 -flto -fno-exceptions -DIS_64BIT -DNDEBUG -Wall -Werror -Wextra -Wno-error=vla -Wpedantic -Wno-unused-command-line-argument -DGIT_HASH=\"\" -DUSE_AVX2 -DUSE_SIMD -mavx2 -mbmi -mbmi2 -DNETWORK_NAME=\"net60.nnue\" -DEVALFILE=\"processed.bin\" -march=native -MMD -MP -c Source/datagen.c -o .tmp/Source/datagen.o -pthread -lm
gcc -g -std=gnu11 -funroll-loops -O3 -flto -fno-exceptions -DIS_64BIT -DNDEBUG -Wall -Werror -Wextra -Wno-error=vla -Wpedantic -Wno-unused-command-line-argument -DGIT_HASH=\"\" -DUSE_AVX2 -DUSE_SIMD -mavx2 -mbmi -mbmi2 -DNETWORK_NAME=\"net60.nnue\" -DEVALFILE=\"processed.bin\" -march=native -MMD -MP -c Source/syzygy.c -o .tmp/Source/syzygy.o -pthread -lm
gcc -g -std=gnu11 -funroll-loops -O3 -flto -fno-exceptions -DIS_64BIT -DNDEBUG -Wall -Werror -Wextra -Wno-error=vla -Wpedantic -Wno-unused-command-line-argument -DGIT_HASH=\"\" -DUSE_AVX2 -DUSE_SIMD -mavx2 -mbmi -mbmi2 -DNETWORK_NAME=\"net60.nnue\" -DEVALFILE=\"processed.bin\" -march=native -MMD -MP -c Source/attacks.c -o .tmp/Source/attacks.o -pthread -lm
gcc -g -std=gnu11 -funroll-loops -O3 -flto -fno-exceptions -DIS_64BIT -DNDEBUG -Wall -Werror -Wextra -Wno-error=vla -Wpedantic -Wno-unused-command-line-argument -DGIT_HASH=\"\" -DUSE_AVX2 -DUSE_SIMD -mavx2 -mbmi -mbmi2 -DNETWORK_NAME=\"net60.nnue\" -DEVALFILE=\"processed.bin\" -march=native -MMD -MP -c Source/see.c -o .tmp/Source/see.o -pthread -lm
gcc -g -std=gnu11 -funroll-loops -O3 -flto -fno-exceptions -DIS_64BIT -DNDEBUG -Wall -Werror -Wextra -Wno-error=vla -Wpedantic -Wno-unused-command-line-argument -DGIT_HASH=\"\" -DUSE_AVX2 -DUSE_SIMD -mavx2 -mbmi -mbmi2 -DNETWORK_NAME=\"net60.nnue\" -DEVALFILE=\"processed.bin\" -march=native -MMD -MP -c Source/movegen.c -o .tmp/Source/movegen.o -pthread -lm
gcc -g -std=gnu11 -funroll-loops -O3 -flto -fno-exceptions -DIS_64BIT -DNDEBUG -Wall -Werror -Wextra -Wno-error=vla -Wpedantic -Wno-unused-command-line-argument -DGIT_HASH=\"\" -DUSE_AVX2 -DUSE_SIMD -mavx2 -mbmi -mbmi2 -DNETWORK_NAME=\"net60.nnue\" -DEVALFILE=\"processed.bin\" -march=native -MMD -MP -c Source/quanticade.c -o .tmp/Source/quanticade.o -pthread -lm
gcc -g -std=gnu11 -funroll-loops -O3 -flto -fno-exceptions -DIS_64BIT -DNDEBUG -Wall -Werror -Wextra -Wno-error=vla -Wpedantic -Wno-unused-command-line-argument -DGIT_HASH=\"\" -DUSE_AVX2 -DUSE_SIMD -mavx2 -mbmi -mbmi2 -DNETWORK_NAME=\"net60.nnue\" -DEVALFILE=\"processed.bin\" -march=native -MMD -MP -c Source/move.c -o .tmp/Source/move.o -pthread -lm
gcc -g -std=gnu11 -funroll-loops -O3 -flto -fno-exceptions -DIS_64BIT -DNDEBUG -Wall -Werror -Wextra -Wno-error=vla -Wpedantic -Wno-unused-command-line-argument -DGIT_HASH=\"\" -DUSE_AVX2 -DUSE_SIMD -mavx2 -mbmi -mbmi2 -DNETWORK_NAME=\"net60.nnue\" -DEVALFILE=\"processed.bin\" -march=native -MMD -MP -c Source/perft.c -o .tmp/Source/perft.o -pthread -lm
gcc -g -std=gnu11 -funroll-loops -O3 -flto -fno-exceptions -DIS_64BIT -DNDEBUG -Wall -Werror -Wextra -Wno-error=vla -Wpedantic -Wno-unused-command-line-argument -DGIT_HASH=\"\" -DUSE_AVX2 -DUSE_SIMD -mavx2 -mbmi -mbmi2 -DNETWORK_NAME=\"net60.nnue\" -DEVALFILE=\"processed.bin\" -march=native -MMD -MP -c Source/wdl.c -o .tmp/Source/wdl.o -pthread -lm
gcc -g -std=gnu11 -funroll-loops -O3 -flto -fno-exceptions -DIS_64BIT -DNDEBUG -Wall -Werror -Wextra -Wno-error=vla -Wpedantic -Wno-unused-command-line-argument -DGIT_HASH=\"\" -DUSE_AVX2 -DUSE_SIMD -mavx2 -mbmi -mbmi2 -DNETWORK_NAME=\"net60.nnue\" -DEVALFILE=\"processed.bin\" -march=native -MMD -MP -c Source/transposition.c -o .tmp/Source/transposition.o -pthread -lm
gcc -g -std=gnu11 -funroll-loops -O3 -flto -fno-exceptions -DIS_64BIT -DNDEBUG -Wall -Werror -Wextra -Wno-error=vla -Wpedantic -Wno-unused-command-line-argument -DGIT_HASH=\"\" -DUSE_AVX2 -DUSE_SIMD -mavx2 -mbmi -mbmi2 -DNETWORK_NAME=\"net60.nnue\" -DEVALFILE=\"processed.bin\" -march=native -MMD -MP -c Source/threads.c -o .tmp/Source/threads.o -pthread -lm
gcc -g -std=gnu11 -funroll-loops -O3 -flto -fno-exceptions -DIS_64BIT -DNDEBUG -Wall -Werror -Wextra -Wno-error=vla -Wpedantic -Wno-unused-command-line-argument -DGIT_HASH=\"\" -DUSE_AVX2 -DUSE_SIMD -mavx2 -mbmi -mbmi2 -DNETWORK_NAME=\"net60.nnue\" -DEVALFILE=\"processed.bin\" -march=native -MMD -MP -c Source/spsa.c -o .tmp/Source/spsa.o -pthread -lm
gcc -g -std=gnu11 -funroll-loops -O3 -flto -fno-exceptions -DIS_64BIT -DNDEBUG -Wall -Werror -Wextra -Wno-error=vla -Wpedantic -Wno-unused-command-line-argument -DGIT_HASH=\"\" -DUSE_AVX2 -DUSE_SIMD -mavx2 -mbmi -mbmi2 -DNETWORK_NAME=\"net60.nnue\" -DEVALFILE=\"processed.bin\" -march=native -MMD -MP -c Source/stats.c -o .tmp/Source/stats.o -pthread -lm
gcc -g -std=gnu11 -funroll-loops -O3 -flto -fno-exceptions -DIS_64BIT -DNDEBUG -Wall -Werror -Wextra -Wno-error=vla -Wpedantic -Wno-unused-command-line-argument -DGIT_HASH=\"\" -DUSE_AVX2 -DUSE_SIMD -mavx2 -mbmi -mbmi2 -DNETWORK_NAME=\"net60.nnue\" -DEVALFILE=\"processed.bin\" -march=native -MMD -MP -c Source/search.c -o .tmp/Source/search.o -pthread -lm
gcc -g -std=gnu11 -funroll-loops -O3 -flto -fno-exceptions -DIS_64BIT -DNDEBUG -Wall -Werror -Wextra -Wno-error=vla -Wpedantic -Wno-unused-command-line-argument -DGIT_HASH=\"\" -DUSE_AVX2 -DUSE_SIMD -mavx2 -mbmi -mbmi2 -DNETWORK_NAME=\"net60.nnue\" -DEVALFILE=\"processed.bin\" -march=native -MMD -MP -c Source/pext_magics.c -o .tmp/Source/pext_magics.o -pthread -lm
gcc -g -std=gnu11 -funroll-loops -O3 -flto -fno-exceptions -DIS_64BIT -DNDEBUG -Wall -Werror -Wextra -Wno-error=vla -Wpedantic -Wno-unused-command-line-argument -DGIT_HASH=\"\" -DUSE_AVX2 -DUSE_SIMD -mavx2 -mbmi -mbmi2 -DNETWORK_NAME=\"net60.nnue\" -DEVALFILE=\"processed.bin\" -march=native -MMD -MP -c Source/nnue.c -o .tmp/Source/nnue.o -pthread -lm
gcc -g -std=gnu11 -funroll-loops -O3 -flto -fno-exceptions -DIS_64BIT -DNDEBUG -Wall -Werror -Wextra -Wno-error=vla -Wpedantic -Wno-unused-command-line-argument -DGIT_HASH=\"\" -DUSE_AVX2 -DUSE_SIMD -mavx2 -mbmi -mbmi2 -DNETWORK_NAME=\"net60.nnue\" -DEVALFILE=\"processed.bin\" -march=native -MMD -MP -c Source/history.c -o .tmp/Source/history.o -pthread -lm
gcc -g -std=gnu11 -funroll-loops -O3 -flto -fno-exceptions -DIS_64BIT -DNDEBUG -Wall -Werror -Wextra -Wno-error=vla -Wpedantic -Wno-unused-command-line-argument -DGIT_HASH=\"\" -DUSE_AVX2 -DUSE_SIMD -mavx2 -mbmi -mbmi2 -DNETWORK_NAME=\"net60.nnue\" -DEVALFILE=\"processed.bin\" -march=native -MMD -MP -c Source/utils.c -o .tmp/Source/utils.o -pthread -lm
Source/attacks.c: In function ‘knight_threats_setwise’:
Source/attacks.c:588:8: error: implicit declaration of function ‘__builtin_shufflevector’; did you mean ‘__builtin_eh_filter’? [-Werror=implicit-function-declaration]
  588 |   g |= __builtin_shufflevector(g, g, 2, 3, 0, 1);
      |        ^~~~~~~~~~~~~~~~~~~~~~~
      |        __builtin_eh_filter
Source/attacks.c: At top level:
cc1: error: unrecognized command line option ‘-Wno-unused-command-line-argument’ [-Werror]
cc1: all warnings being treated as errors
make: *** [Makefile:277: .tmp/Source/attacks.o] Erro 1
make: ** Esperando que outros processos terminem.